{"text_format":"1","workbook":"xlsx","n_sheets":11,"sheets":["Índice","Presentación","Informantes","Participantes","CNGE_2023_M7_Secc2","listas","comparar","Complemento 1","Complemento 2","Complemento 3","Glosario"],"not_rendered":{"charts":0,"images":7,"macros":1,"external_links":0,"defined_names":73,"comments":0,"pivot_tables":0},"unopened":[],"bounds":{"document_bytes":16777216,"sheet_cells":100000,"rows_first":2000,"rows_last":500,"rows_between":2000,"halvings":0,"cell_chars":16384,"cell_head_chars":4096},"cells_cut":0,"cells_raw":0,"read":"whole","date_system":"1900"}

{"sheet":"Índice","index":0,"n_rows":25,"n_cols":23,"rows_kept":25,"cut":false,"hidden":false,"merged":[[22,1,22,20],[24,1,24,20],[16,22,16,29],[10,1,10,20],[12,1,12,20],[14,1,14,20],[16,1,16,20],[18,1,18,20],[20,1,20,20],[0,1,0,29],[2,1,2,29],[4,1,4,29],[6,1,6,29],[8,1,8,11],[8,13,8,14]]}
[null,"CENSO NACIONAL DE GOBIERNOS\nESTATALES 2023"]
[]
[null,"Módulo 7.\nCatastro, registro y territorio"]
[]
[null,"Sección II. Registro Público de la Propiedad"]
[]
[null,"Índice"]
[null,"Entidad:",null,null,null,null,null,null,null,null,null,null,null,"Clave:"]
[null,{"$f":"IF(Presentación!B10=\"\",\"\",Presentación!B10)","v":"Veracruz de Ignacio de la Llave"},null,null,null,null,null,null,null,null,null,null,null,{"$f":"Presentación!N10","v":"30"}]
[]
[null,"Presentación"]
[]
[null,"Informantes"]
[]
[null,"Participantes"]
[]
[null,"Sección II. Registro Público de la Propiedad",null,null,null,null,null,null,null,null,null,null,null,null,null,null,null,null,null,null,null,null,"Preguntas 2.1 a 2.83"]
[]
[null,"Complemento 1"]
[]
[null,"Complemento 2"]
[]
[null,"Complemento 3"]
[]
[null,"Glosario"]

{"sheet":"Presentación","index":1,"n_rows":129,"n_cols":27,"rows_kept":129,"cut":false,"hidden":false,"merged":[[110,3,110,28],[101,5,101,9],[101,10,101,25],[102,5,102,9],[102,10,102,25],[103,5,103,9],[103,10,103,25],[104,5,104,9],[104,10,104,25],[126,6,126,28],[127,8,127,28],[128,6,128,16],[128,20,128,28],[114,3,114,28],[116,7,116,28],[122,2,122,28],[124,6,124,28],[125,10,125,28],[118,7,118,28],[60,3,60,28],[54,2,54,28],[56,2,56,28],[106,2,106,28],[100,5,100,9],[100,10,100,25],[76,2,76,28],[78,2,78,28],[80,3,80,28],[82,2,82,28],[84,2,84,28],[86,2,86,28],[90,2,90,28],[92,2,92,28],[94,2,94,28],[96,2,96,28],[98,2,98,28],[36,2,36,28],[38,3,38,28],[40,2,40,28],[74,2,74,28],[44,2,44,28],[46,2,46,28],[48,2,48,28],[58,2,58,28],[62,2,62,28],[64,3,64,28],[66,3,66,28],[68,3,68,28],[70,3,70,28],[72,3,72,28],[50,2,50,28],[9,1,9,11],[9,13,9,14],[12,2,12,10],[12,14,12,28],[52,2,52,28],[26,2,26,28],[28,2,28,28],[30,2,30,28],[32,2,32,28],[34,2,34,28],[42,2,42,28],[20,2,20,28],[22,2,22,28],[24,3,24,28],[15,2,15,28],[18,2,18,28],[0,1,0,29],[2,1,2,29],[4,1,4,29],[6,1,6,29],[8,26,8,29]]}
[null,"CENSO NACIONAL DE GOBIERNOS\nESTATALES 2023"]
[]
[null,"Módulo 7.\nCatastro, registro y territorio"]
[]
[null,"Sección II. Registro Público de la Propiedad"]
[]
[null,"Presentación"]
[]
[null,"Entidad:",null,null,null,null,null,null,null,null,null,null,null,"Clave:",null,null,null,null,null,null,null,null,null,null,null,null,"Índice"]
[null,"Veracruz de Ignacio de la Llave",null,null,null,null,null,null,null,null,null,null,null,{"$f":"IF(B10=\"\",\"\",VLOOKUP(B10,I_ENTIDAD2,2,FALSE))","v":"30"}]
[]
[null,null,"CONFIDENCIALIDAD",null,null,null,null,null,null,null,null,null,null,null,"OBLIGATORIEDAD"]
[null,null,"Conforme a lo dispuesto por el Artículo 37, párrafo primero de la Ley del Sistema Nacional de Información Estadística y Geográfica: \"Los datos que proporcionen para fines estadísticos los Informantes del Sistema a las Unidades en términos de la presente Ley, serán estrictamente confidenciales y bajo ninguna circunstancia podrán utilizarse para otro fin que no sea el estadístico.\"",null,null,null,null,null,null,null,null,null,null,null,"Conforme a lo dispuesto por el Artículo 45, párrafo primero de la Ley del Sistema Nacional de Información Estadística y Geográfica: \"Los Informantes del Sistema estarán obligados a proporcionar, con veracidad y oportunidad, los datos e informes que les soliciten las autoridades competentes para fines estadísticos, censales y geográficos, y prestarán apoyo a las mismas\", así como lo señalado por el Artículo 46 de la misma: \"[...] Los servidores públicos de la Federación, de las entidades federativas, de los municipios y de las demarcaciones territoriales de la Ciudad de México, tendrán la obligación de proporcionar la información básica que hubieren obtenido en el ejercicio de sus funciones y sirva para generar Información de Interés Nacional, que les solicite el Instituto [...]\""]
[]
[null,null,"DERECHOS DE LOS INFORMANTES DEL SISTEMA"]
[null,null,"De conformidad con lo previsto en el Artículo 41 de la Ley del Sistema Nacional de Información Estadística y Geográfica, los informantes del Sistema tendrán el derecho de solicitar al Instituto Nacional de Estadística y Geografía que sean rectificados los datos que les conciernan, para lo cual deberán demostrar que son inexactos, incompletos o equívocos."]
[]
[]
[null,null,"El Instituto Nacional de Estadística y Geografía (INEGI) presenta la elaboración del Censo Nacional de Gobiernos Estatales (CNGE) 2023 como respuesta a su responsabilidad de suministrar a la sociedad y al Estado información de calidad, pertinente, veraz y oportuna, atendiendo el mandato constitucional de normar y coordinar el Sistema Nacional de Información Estadística y Geográfica (SNIEG)."]
[]
[null,null,"Dicho Sistema se integra por cuatro subsistemas, mismos que permiten agrupar por temas los diversos campos de información de interés nacional, lo que se traduce en la generación, suministro y difusión de información de manera ordenada y bajo esquemas integrales y homogéneos que promuevan el cumplimiento de los objetivos del SNIEG."]
[]
[null,null,"Los subsistemas son los siguientes:"]
[]
[null,null,null,"Subsistema Nacional de Información Demográfica y Social.\nSubsistema Nacional de Información Económica.\nSubsistema Nacional de Información Geográfica, Medio Ambiente, Ordenamiento Territorial y Urbano.\nSubsistema Nacional de Información de Gobierno, Seguridad Pública e Impartición de Justicia."]
[]
[null,null,"El Subsistema Nacional de Información de Gobierno, Seguridad Pública e Impartición de Justicia (SNIGSPIJ) fue creado mediante acuerdo de la Junta de Gobierno del INEGI el 8 de diciembre de 2008, quedando establecido como el cuarto Subsistema Nacional de Información según los artículos 17 y 28 bis de la Ley del SNIEG."]
[]
[null,null,"El SNIGSPIJ tiene como objetivo estratégico institucionalizar y operar un esquema coordinado para la producción, integración, conservación y difusión de información estadística y geográfica de interés nacional, de calidad, pertinente, veraz y oportuna que permita conocer la situación que guardan la gestión y el desempeño de las instituciones públicas que conforman el Estado y sus respectivos poderes en las funciones de gobierno, seguridad pública e impartición de justicia, para apoyar los procesos de diseño, implementación, monitoreo y evaluación de las políticas públicas en estas materias."]
[]
[null,null,"En el marco de dicho Subsistema, específicamente de los trabajos del Comité Técnico Especializado de Información de Gobierno, desde el año 2009 se iniciaron las actividades de revisión y generación de lo que sería el primer instrumento de captación en materia de gobierno, en el que participaron los representantes de las principales instituciones y organizaciones que convergen en dicha materia."]
[]
[null,null,"Como resultado, se logró el acuerdo para generar información estadística en materia de gobierno con una visión integral, implementando así en 2010 el primer instrumento de captación en el ámbito estatal denominado Encuesta Nacional de Gobierno 2010 – Poder Ejecutivo Estatal (ENGPEE 10), con lo cual se inició una serie histórica de información que permite diseñar, monitorear y evaluar las políticas públicas en este tema. "]
[]
[null,null,"Posteriormente, en 2011 se realizó el segundo levantamiento de este programa estadístico bajo la denominación de Censo Nacional de Gobierno 2011. Poder Ejecutivo Estatal (CNG 2011 PEE). El 20 de diciembre de ese mismo año se publicó en el Diario Oficial de la Federación el acuerdo por el cual la Junta de Gobierno del INEGI determinó como Información de Interés Nacional (IIN) los datos generados por este programa, otorgándoles el carácter de oficiales y de uso obligatorio para la Federación, las entidades federativas, el Distrito Federal (ahora Ciudad de México) y los municipios, siendo a partir de ese momento que se institucionalizó como Censo Nacional de Gobierno, Seguridad Pública y Sistema Penitenciario Estatales, por lo que dicha edición (con información 2010) se publicó con la denominación de IIN."]
[]
[null,null,"Desde entonces, se continuaron anualmente las labores de levantamiento del CNGSPSPE hasta su última edición en 2020, año a partir del cual se separa este programa estadístico en tres Censos Nacionales de Gobierno; cada uno orientado a las materias específicas de gobierno, seguridad pública y sistema penitenciario:"]
[]
[null,null,null,"Censo Nacional de Gobiernos Estatales;\nCenso Nacional de Seguridad Pública Estatal; y\nCenso Nacional de Sistemas Penitenciarios Estatales."]
[]
[null,null,"Lo anterior, como resultado de las numerosas e importantes reformas constitucionales realizadas en los últimos años, entre las que destacan aquellas en materia de seguridad pública y combate a la corrupción. En consecuencia, el Estado Mexicano ha venido transitando por un periodo de evolución, crecimiento y diversificación institucional, multiplicando con ello sus obligaciones, responsabilidades y facultades. Desde el punto de vista estadístico, los nuevos arreglos institucionales y compromisos establecidos por ley generaron nuevas necesidades de información, lo que incidió en la necesidad de realizar ajustes en materias y conceptos previamente establecidos."]
[]
[null,null,"Este proceso de segmentación implicó revocar la determinación de Información de Interés Nacional al CNGSPSPE mediante el acuerdo de la Junta de Gobierno del INEGI publicado el 29 de enero de 2021 en el Diario Oficial de la Federación. Este cambio tuvo como finalidad ampliar el alcance temático y analítico de cada rubro, así como adecuar conceptual y metodológicamente sus contenidos a las necesidades de información vigentes en las reformas constitucionales y en la transformación institucional del país."]
[]
[null,null,"Como resultado de dicha división, ahora se cuenta con el Censo Nacional de Gobiernos Estatales (CNGE) 2022, cuyos resultados pueden ser consultados en la página de internet del Instituto: https://www.inegi.org.mx/programas/cnge/2022/"]
[]
[null,null,"Específicamente para la materia de protección civil es importante mencionar que durante 2021 y 2022 ocurrieron una serie de reuniones con personal del Centro Nacional de Prevención de Desastres (CENAPRED), de la Dirección General de Protección Civil y de la Dirección General para la Gestión de Riesgos de la Secretaría de Seguridad y Protección Ciudadana (SSPC) a efecto de consolidar un instrumento de captación que permita conocer de forma específica las capacidades operativas con las que cuentan las Unidades Estatales de Protección Civil u homólogas de las entidades federativas, retomando los contenidos establecidos en la Encuesta de Autoevaluación para las Unidades Estatales de Protección Civil, misma que fue implementada por dicha institución en ejercicios anteriores."]
[]
[null,null,"Asimismo, a partir del contexto nacional y de la implementación de la Ley General en Materia de Desaparición Forzada de Personas, Desaparición Cometida por Particulares y del Sistema Nacional de Búsqueda de Personas, así como del Programa Nacional de Exhumaciones e Identificación Forense, que de ella emana, fue necesario comenzar a generar información específica sobre las capacidades institucionales de los servicios médicos forenses y periciales del país, así como del ejercicio de su función en cuanto a la identificación, disposición y almacenamientos de cadáveres y/o de restos de seres humanos."]
[]
[null,null,"Derivado de las similitudes operativas con los temas de protección civil y servicios periciales, y considerando su naturaleza normativa, conceptual y metodológica, se tomó la decisión de elaborar un módulo específico con información asociada a la función de defensoría pública, retomando las principales necesidades de información existentes en la materia, así como los diseños institucionales establecidos para el ejercicio de la misma."]
[]
[null,null,"Como resultado, esta edición del CNGE consolida la información generada en dichas materias en tres módulos específicos, los cuales retoman y profundizan los contenidos que hacían parte de las respectivas secciones del módulo 1 en anteriores ediciones."]
[]
[null,null,"Por su parte, atendiendo a los procesos de levantamientos diferenciados establecidos para un mejor aprovechamiento de la información estadística, la presente edición del CNGE considera el tema de justicia cívica (aplicable únicamente a la Ciudad de México). Su finalidad es generar información estandarizada y comparable con la emanada del Censo Nacional de Gobiernos Municipales y Demarcaciones Territoriales de la Ciudad de México (CNGMD); de tal forma que se generen datos con una misma temporalidad que permitan conocer la implementación del Modelo Homologado de Justicia Cívica, Buen Gobierno y Cultura de la Legalidad para los Municipios de México."]
[]
[null,null,"Así, se presenta el Censo Nacional de Gobiernos Estatales (CNGE) 2023, como el decimocuarto programa estadístico desarrollado por el INEGI en materia de gobierno en el ámbito estatal del Estado Mexicano. Si bien el proceso de maduración de la información captada a través de este ha obligado a realizar ajustes en algunas variables, se ha preservado en todo momento la consistencia conceptual respecto de sus ediciones anteriores, continuando con la serie estadística y enriqueciendo sus contenidos por los temas que actualmente se desarrollan."]
[]
[null,null,"El CNGE 2023 se conforma por los siguientes módulos:"]
[]
[null,null,null,"Módulo 1. Administración Pública de la entidad federativa\nMódulo 2. Protección civil\nMódulo 3. Servicios periciales\nMódulo 4. Defensoría pública\nMódulo 5. Justicia cívica\nMódulo 6. Medio ambiente\nMódulo 7. Catastro, registro y territorio"]
[]
[null,null,"Cada uno de estos módulos está conformado, cuando menos, por los siguientes apartados:"]
[]
[null,null,null,"Presentación. Contiene la introducción general y antecedentes del censo, así como las instrucciones generales para la entrega formal del presente instrumento de captación."]
[]
[null,null,null,"Informantes. En este apartado se recaba información sobre las personas servidoras públicas designadas por las Unidades del Estado como responsables de recopilar, integrar y entregar la información requerida en el cuestionario."]
[]
[null,null,null,"Participantes. Presenta un espacio destinado a la identificación de las personas servidoras públicas que participaron en el llenado de cada módulo y/o sección, según corresponda. "]
[]
[null,null,null,"Cuestionario. Se integra por cada una de las preguntas destinadas a generar información estadística sobre los aspectos que conforman la estructura temática del presente programa. Con la finalidad de facilitar la ubicación de los temas contenidos, la versión electrónica del mismo se ha dividido en tantas pestañas como secciones son requeridas."]
[]
[null,null,null,"Glosario. Contiene un listado de conceptos y definiciones que se consideran relevantes para el llenado del cuestionario."]
[]
[null,null,"Asimismo, tomando en consideración la naturaleza de la información solicitada en cada módulo, alguno de estos puede presentar apartados adicionales a los anteriores, mismos que obedecen a características específicas del programa estadístico relacionado. Dichos apartados pueden ser: complementos, anexos y adiciones."]
[]
[null,null,"Particularmente, en el módulo 7 se solicita, entre otra, información sobre la estructura organizacional de las instituciones encargadas del ejercicio de catastro, registro público de la propiedad y planeación y gestión territorial de cada entidad federativa; la distribución de los recursos humanos; la cantidad, tipos y características de acceso a los trámites y servicios prestados; así como los elementos y acciones institucionales que se llevan a cabo para la vinculación e intercambio de la información, entre otros."]
[]
[null,null,"Para ello, este módulo contiene 244 preguntas agrupadas en las siguientes secciones:"]
[]
[null,null,null,"Sección I. Catastro\nSección II. Registro público de la propiedad\nSección III. Planeación y gestión territorial                                    "]
[]
[null,null,"Considerando la relevancia y diversidad de la información solicitada a través del cuestionario, es necesario que los informantes responsables de su llenado sean personas funcionarias públicas que, por sus atribuciones y actividades cotidianas, cuenten con la información adecuada y necesaria. A efecto de facilitar la recolección de la información solicitada, las personas responsables del llenado del cuestionario pueden auxiliarse de las personas servidoras públicas que integran sus equipos de trabajo. Cuando esto suceda, se solicita que registren sus datos en el apartado Participantes."]
[]
[null,null,"Las personas servidoras públicas que se establecen como informantes deberán validar y formalizar la entrega de la información proporcionada, ello mediante el estampado de su firma en la portada de cada módulo o sección, así como del sello de la institución que representan. Cabe destacar que la información recabada mediante el censo, una vez recibida con la firma de la o las personas servidoras públicas responsables y sello de la institución, será considerada como información oficial en términos de lo establecido en la Ley del SNIEG."]
[]
[null,null,"El INEGI pondrá a disposición de la sociedad la información de este programa de forma gratuita a través del Servicio Público de Información, además de poder consultarse y descargarse de forma electrónica en el portal del Instituto."]
[]
[]
[]
[null,null,"La entrega de información deberá hacerse a través del Departamento de Estadísticas de Gobierno de la Coordinación Estatal del INEGI en su entidad federativa, quien se acercará a los equipos de trabajo designados por la persona titular y/o servidora pública responsable para el llenado del cuestionario, con el objetivo de organizar los trabajos y recuperar la información requerida."]
[]
[null,null,"Una primera versión completa de la información, considerada como preliminar, tendrá un proceso de revisión y validación por parte del personal del INEGI en la Coordinación Estatal, con base en los criterios establecidos. Una vez concluida, el cuestionario será devuelto a la persona servidora pública responsable del llenado en la institución informante, a efecto de notificarle los resultados de la revisión y los ajustes o aclaraciones de información que, de ser procedentes, deberán atenderse. En caso de no presentar observaciones, será remitido a las Oficinas Centrales del INEGI para una verificación y revisión central."]
[]
[null,null,"Si la verificación y revisión central arroja observaciones o solicitud de aclaración de información, el cuestionario será devuelto a la Coordinación Estatal para la atención o justificación de estas situaciones con la institución informante. En caso de que no existan observaciones o estas sean debidamente atendidas, se procederá con la liberación del cuestionario como versión definitiva, para que se proceda con la impresión y formalización de la información plasmada, mediante la firma y sello del instrumento físico por parte del informante básico e informantes complementarios."]
[]
[null,null,"En este sentido, una vez completado el llenado de este instrumento, deberá enviarse en versión preliminar a la dirección electrónica de la Jefa o el Jefe de Departamento de Estadísticas de Gobierno (JDEG) de la Coordinación Estatal del INEGI: isis.rosas@inegi.org.mx"]
[]
[null,null,"A efecto de llevar a cabo la revisión y validación del cuestionario, en la siguiente tabla se detallan los periodos en los que se realizarán las actividades en cada entidad federativa:"]
[]
[null,null,null,null,null,"Fecha",null,null,null,null,"Actividad"]
[null,null,null,null,null," 06 de marzo   al 28 de abril ",null,null,null,null,"Integración de información por la institución. \nEntrega a la CE del INEGI para revisión."]
[null,null,null,null,null," 13 de marzo   al 05 de abril ",null,null,null,null,"Revisión de información preliminar por parte de la CE del INEGI y aclaración o ajustes por parte del informante. \nEnvío de información preliminar a OC para verificación central."]
[null,null,null,null,null," 27 de marzo   al 04 de mayo",null,null,null,null,"Verificación de información preliminar por parte de OC y aclaración o ajustes de información.\nLiberación de cuestionario como información definitiva."]
[null,null,null,null,null,"08 de mayo al  16 de junio",null,null,null,null,"Recuperación de cuestionario físico con información completa y definitiva, con firma y sello."]
[]
[null,null,"Una vez que el archivo electrónico esté impreso y firmado, se llevará a cabo la entrega de la versión definitiva del cuestionario vía electrónica y de manera física, para lo cual se tomará en cuenta lo siguiente:"]
[]
[null,null,null,"1) Entrega electrónica:"]
[]
[null,null,null,"La versión definitiva del cuestionario en su versión electrónica deberá ser la misma que se entregue en versión física, de conformidad con las instrucciones correspondientes. Dicha entrega deberá realizarse en la dirección electrónica siguiente: isis.rosas@inegi.org.mx"]
[]
[null,null,null,"2) Entrega física:"]
[]
[null,null,null,"La versión impresa, con las firmas correspondientes, deberá entregarse en la Coordinación Estatal del INEGI con los siguientes datos: \n"]
[]
[null,null,null,"Destinatario:",null,null,null,"Ing. Juan Manuel Yglesias López"]
[]
[null,null,null,"Dirección:",null,null,null,"Av. Araucarias #3, Col. Esther Badillo, CP 91190, Xalapa, Ver."]
[]
[]
[]
[null,null,"En caso de dudas o comentarios, deberá hacerlos llegar al personal del Departamento de Estadísticas de Gobierno de la Coordinación Estatal del INEGI que haya sido designado para el seguimiento de este programa de información, quien tiene los siguientes datos de contacto:"]
[]
[null,null,null,"Nombre:",null,null,"Isis Rosas Roldan "]
[null,null,null,"Área o unidad de adscripción:",null,null,null,null,null,null,"Subdirección Estatal de Estadística Económica / Coordinación Estatal Veracruz"]
[null,null,null,"Cargo:",null,null,"Jefa de departamento de Estadísticas de Gobierno"]
[null,null,null,"Correo electrónico:",null,null,null,null,"isis.rosas@inegi.org.mx"]
[null,null,null,"Teléfono:",null,null,2288418452,null,null,null,null,null,null,null,null,null,null,"Extensión:",null,null,"8096/8496"]

{"sheet":"Informantes","index":2,"n_rows":51,"n_cols":27,"rows_kept":51,"cut":false,"hidden":false,"merged":[[25,2,25,16],[25,19,25,29],[28,5,28,16],[40,12,40,16],[37,1,37,17],[37,19,37,29],[38,2,38,16],[27,20,27,28],[28,20,34,28],[27,12,27,16],[31,7,31,16],[32,4,32,16],[33,5,33,16],[34,7,34,16],[29,6,29,16],[30,7,30,16],[51,2,51,28],[41,5,41,16],[42,6,42,16],[43,7,43,16],[44,7,44,16],[45,4,45,16],[46,5,46,16],[47,7,47,16],[41,20,47,28],[38,19,38,29],[40,20,40,28],[11,1,11,17],[11,19,11,29],[12,2,12,16],[12,19,12,29],[24,1,24,17],[24,19,24,29],[15,5,15,16],[16,6,16,16],[17,7,17,16],[18,7,18,16],[19,4,19,16],[20,5,20,16],[21,7,21,16],[14,20,14,28],[15,20,21,28],[14,12,14,16],[0,1,0,29],[2,1,2,29],[4,1,4,29],[6,1,6,29],[9,1,9,11],[9,13,9,14],[8,26,8,29]]}
[null,"CENSO NACIONAL DE GOBIERNOS\nESTATALES 2023"]
[]
[null,"Módulo 7.\nCatastro, registro y territorio"]
[]
[null,"Sección II. Registro Público de la Propiedad"]
[]
[null,"Informantes\n(Responde: institución registral de la Administración Pública de la entidad federativa)"]
[]
[null,"Entidad:",null,null,null,null,null,null,null,null,null,null,null,"Clave:",null,null,null,null,null,null,null,null,null,null,null,null,"Índice"]
[null,{"$f":"IF(Presentación!B10=\"\",\"\",Presentación!B10)","v":"Veracruz de Ignacio de la Llave"},null,null,null,null,null,null,null,null,null,null,null,{"$f":"Presentación!N10","v":"30"}]
[]
[null,"INFORMANTE BÁSICO",null,null,null,null,null,null,null,null,null,null,null,null,null,null,null,null,null,"FIRMA Y SELLO"]
[null,null,"(Persona titular o servidora pública de la institución designada para proveer la información de la presente sección, y que tiene el carácter de figura responsable de validar y oficializar la información. Cuando menos, se encuentra en el segundo o tercer nivel jerárquico de la misma)",null,null,null,null,null,null,null,null,null,null,null,null,null,null,null,null,"VoBo. a la información contenida en el presente cuestionario"]
[]
[null,null,"Título (Lic., Mtro(a)., Dr(a)., Ing., C., Sr(a)., etc.):",null,null,null,null,null,null,null,null,null,null,null,null,null,null,null,null,null,"FIRMA"]
[null,null,"Nombre(s):"]
[null,null,"Primer apellido:"]
[null,null,"Segundo apellido:"]
[null,null,"Institución u órgano:"]
[null,null,"Cargo:"]
[null,null,"Teléfono:"]
[null,null,"Correo electrónico:"]
[]
[]
[null,"INFORMANTE COMPLEMENTARIO 1",null,null,null,null,null,null,null,null,null,null,null,null,null,null,null,null,null,"FIRMA Y SELLO"]
[null,null,"(Persona servidora pública que, por las funciones que tiene asignadas dentro de la institución, es la principal productora y/o integradora de la información correspondiente a la presente sección y, cuando menos, se encuentra en el segundo o tercer nivel jerárquico de la misma. Nota: en caso de no requerir al \"Informante Complementario 1\" deje las siguientes celdas en blanco)",null,null,null,null,null,null,null,null,null,null,null,null,null,null,null,null,"VoBo. a la información contenida en el presente cuestionario"]
[]
[null,null,"Título (Lic., Mtro(a)., Dr(a)., Ing., C., Sr(a)., etc.):",null,null,null,null,null,null,null,null,null,null,null,null,null,null,null,null,null,"FIRMA"]
[null,null,"Nombre(s):"]
[null,null,"Primer apellido:"]
[null,null,"Segundo apellido:"]
[null,null,"Institución u órgano:"]
[null,null,"Cargo:"]
[null,null,"Teléfono:"]
[null,null,"Correo electrónico:"]
[]
[]
[null,"INFORMANTE COMPLEMENTARIO 2",null,null,null,null,null,null,null,null,null,null,null,null,null,null,null,null,null,"FIRMA Y SELLO"]
[null,null,"(Persona servidora pública que, por las funciones que tiene asignadas dentro de la institución, es la segunda principal productora y/o integradora de la información correspondiente a la presente sección y, cuando menos, se encuentra en el segundo o tercer nivel jerárquico de la misma. Nota: en caso de no requerir al \"Informante Complementario 2\" deje las siguientes celdas en blanco)",null,null,null,null,null,null,null,null,null,null,null,null,null,null,null,null,"VoBo. a la información contenida en el presente cuestionario"]
[]
[null,null,"Título (Lic., Mtro(a)., Dr(a)., Ing., C., Sr(a)., etc.):",null,null,null,null,null,null,null,null,null,null,null,null,null,null,null,null,null,"FIRMA"]
[null,null,"Nombre(s):"]
[null,null,"Primer apellido:"]
[null,null,"Segundo apellido:"]
[null,null,"Institución u órgano:"]
[null,null,"Cargo:"]
[null,null,"Teléfono:"]
[null,null,"Correo electrónico:"]
[]
[]
[null,null,"OBSERVACIONES:"]

{"sheet":"Participantes","index":3,"n_rows":66,"n_cols":60,"rows_kept":66,"cut":false,"hidden":false,"merged":[[64,43,64,46],[64,47,64,50],[64,51,64,56],[65,2,65,4],[65,5,65,7],[65,8,65,10],[65,11,65,13],[65,14,65,17],[65,18,65,20],[65,21,65,23],[65,24,65,26],[65,27,65,30],[65,31,65,34],[65,35,65,38],[65,39,65,42],[65,43,65,46],[65,47,65,50],[65,51,65,56],[64,2,64,4],[64,5,64,7],[64,8,64,10],[64,11,64,13],[64,14,64,17],[64,18,64,20],[64,21,64,23],[64,24,64,26],[64,27,64,30],[62,31,62,34],[62,35,62,38],[62,39,62,42],[62,21,62,23],[62,24,62,26],[62,27,62,30],[64,31,64,34],[64,35,64,38],[64,39,64,42],[62,43,62,46],[62,47,62,50],[62,51,62,56],[63,2,63,4],[63,5,63,7],[63,8,63,10],[63,11,63,13],[63,14,63,17],[63,18,63,20],[63,21,63,23],[63,24,63,26],[63,27,63,30],[63,31,63,34],[63,35,63,38],[63,39,63,42],[63,43,63,46],[63,47,63,50],[63,51,63,56],[62,2,62,4],[62,5,62,7],[62,8,62,10],[62,11,62,13],[62,14,62,17],[62,18,62,20],[60,43,60,46],[60,47,60,50],[60,51,60,56],[61,2,61,4],[61,5,61,7],[61,8,61,10],[61,11,61,13],[61,14,61,17],[61,18,61,20],[61,21,61,23],[61,24,61,26],[61,27,61,30],[61,31,61,34],[61,35,61,38],[61,39,61,42],[61,43,61,46],[61,47,61,50],[61,51,61,56],[60,2,60,4],[60,5,60,7],[60,8,60,10],[60,11,60,13],[60,14,60,17],[60,18,60,20],[60,21,60,23],[60,24,60,26],[60,27,60,30],[58,31,58,34],[58,35,58,38],[58,39,58,42],[58,21,58,23],[58,24,58,26],[58,27,58,30],[60,31,60,34],[60,35,60,38],[60,39,60,42],[58,43,58,46],[58,47,58,50],[58,51,58,56],[59,2,59,4],[59,5,59,7],[59,8,59,10],[59,11,59,13],[59,14,59,17],[59,18,59,20],[59,21,59,23],[59,24,59,26],[59,27,59,30],[59,31,59,34],[59,35,59,38],[59,39,59,42],[59,43,59,46],[59,47,59,50],[59,51,59,56],[58,2,58,4],[58,5,58,7],[58,8,58,10],[58,11,58,13],[58,14,58,17],[58,18,58,20],[56,43,56,46],[56,47,56,50],[56,51,56,56],[57,2,57,4],[57,5,57,7],[57,8,57,10],[57,11,57,13],[57,14,57,17],[57,18,57,20],[57,21,57,23],[57,24,57,26],[57,27,57,30],[57,31,57,34],[57,35,57,38],[57,39,57,42],[57,43,57,46],[57,47,57,50],[57,51,57,56],[56,2,56,4],[56,5,56,7],[56,8,56,10],[56,11,56,13],[56,14,56,17],[56,18,56,20],[56,21,56,23],[56,24,56,26],[56,27,56,30],[54,31,54,34],[54,35,54,38],[54,39,54,42],[54,21,54,23],[54,24,54,26],[54,27,54,30],[56,31,56,34],[56,35,56,38],[56,39,56,42],[54,43,54,46],[54,47,54,50],[54,51,54,56],[55,2,55,4],[55,5,55,7],[55,8,55,10],[55,11,55,13],[55,14,55,17],[55,18,55,20],[55,21,55,23],[55,24,55,26],[55,27,55,30],[55,31,55,34],[55,35,55,38],[55,39,55,42],[55,43,55,46],[55,47,55,50],[55,51,55,56],[54,2,54,4],[54,5,54,7],[54,8,54,10],[54,11,54,13],[54,14,54,17],[54,18,54,20],[52,43,52,46],[52,47,52,50],[52,51,52,56],[53,2,53,4],[53,5,53,7],[53,8,53,10],[53,11,53,13],[53,14,53,17],[53,18,53,20],[53,21,53,23],[53,24,53,26],[53,27,53,30],[53,31,53,34],[53,35,53,38],[53,39,53,42],[53,43,53,46],[53,47,53,50],[53,51,53,56],[52,2,52,4],[52,5,52,7],[52,8,52,10],[52,11,52,13],[52,14,52,17],[52,18,52,20],[52,21,52,23],[52,24,52,26],[52,27,52,30],[50,31,50,34],[50,35,50,38],[50,39,50,42],[52,31,52,34],[52,35,52,38],[52,39,52,42],[50,43,50,46],[50,47,50,50],[50,51,50,56],[51,27,51,30],[51,31,51,34],[51,35,51,38],[51,39,51,42],[51,43,51,46],[51,47,51,50],[51,51,51,56],[50,27,50,30],[48,31,48,34],[48,35,48,38],[48,39,48,42],[48,43,48,46],[48,47,48,50],[48,51,48,56],[49,27,49,30],[49,31,49,34],[49,35,49,38],[49,39,49,42],[49,43,49,46],[49,47,49,50],[49,51,49,56],[48,27,48,30],[46,31,46,34],[46,35,46,38],[46,39,46,42],[46,43,46,46],[46,47,46,50],[46,51,46,56],[47,27,47,30],[47,31,47,34],[47,35,47,38],[47,39,47,42],[47,43,47,46],[47,47,47,50],[47,51,47,56],[46,27,46,30],[44,31,44,34],[44,35,44,38],[44,39,44,42],[44,43,44,46],[44,47,44,50],[44,51,44,56],[45,27,45,30],[45,31,45,34],[45,35,45,38],[45,39,45,42],[45,43,45,46],[45,47,45,50],[45,51,45,56],[44,27,44,30],[42,31,42,34],[42,35,42,38],[42,39,42,42],[42,43,42,46],[42,47,42,50],[42,51,42,56],[43,27,43,30],[43,31,43,34],[43,35,43,38],[43,39,43,42],[43,43,43,46],[43,47,43,50],[43,51,43,56],[42,27,42,30],[40,31,40,34],[40,35,40,38],[40,39,40,42],[40,43,40,46],[40,47,40,50],[40,51,40,56],[41,27,41,30],[41,31,41,34],[41,35,41,38],[41,39,41,42],[41,43,41,46],[41,47,41,50],[41,51,41,56],[40,27,40,30],[38,31,38,34],[38,35,38,38],[38,39,38,42],[38,43,38,46],[38,47,38,50],[38,51,38,56],[39,27,39,30],[39,31,39,34],[39,35,39,38],[39,39,39,42],[39,43,39,46],[39,47,39,50],[39,51,39,56],[38,27,38,30],[36,31,36,34],[36,35,36,38],[36,39,36,42],[36,43,36,46],[36,47,36,50],[36,51,36,56],[37,27,37,30],[37,31,37,34],[37,35,37,38],[37,39,37,42],[37,43,37,46],[37,47,37,50],[37,51,37,56],[36,27,36,30],[34,31,34,34],[34,35,34,38],[34,39,34,42],[34,43,34,46],[34,47,34,50],[34,51,34,56],[35,27,35,30],[35,31,35,34],[35,35,35,38],[35,39,35,42],[35,43,35,46],[35,47,35,50],[35,51,35,56],[34,27,34,30],[32,31,32,34],[32,35,32,38],[32,39,32,42],[32,43,32,46],[32,47,32,50],[32,51,32,56],[33,27,33,30],[33,31,33,34],[33,35,33,38],[33,39,33,42],[33,43,33,46],[33,47,33,50],[33,51,33,56],[32,27,32,30],[30,31,30,34],[30,35,30,38],[30,39,30,42],[30,43,30,46],[30,47,30,50],[30,51,30,56],[31,27,31,30],[31,31,31,34],[31,35,31,38],[31,39,31,42],[31,43,31,46],[31,47,31,50],[31,51,31,56],[30,27,30,30],[28,43,28,50],[28,51,29,56],[29,27,29,30],[29,31,29,34],[29,35,29,38],[29,39,29,42],[29,43,29,46],[29,47,29,50],[28,27,28,34],[0,1,0,56],[2,1,2,56],[4,1,4,56],[6,1,6,56],[11,1,11,56],[12,1,12,56],[13,2,13,56],[14,2,14,56],[15,2,15,56],[51,2,51,4],[51,5,51,7],[51,8,51,10],[51,11,51,13],[51,14,51,17],[51,18,51,20],[51,21,51,23],[51,24,51,26],[50,2,50,4],[50,5,50,7],[50,8,50,10],[50,11,50,13],[50,14,50,17],[50,18,50,20],[50,21,50,23],[50,24,50,26],[48,21,48,23],[48,24,48,26],[49,2,49,4],[49,5,49,7],[49,8,49,10],[49,11,49,13],[49,14,49,17],[49,18,49,20],[49,21,49,23],[48,2,48,4],[48,5,48,7],[48,8,48,10],[48,11,48,13],[48,14,48,17],[48,18,48,20],[49,24,49,26],[47,2,47,4],[47,5,47,7],[47,8,47,10],[47,11,47,13],[47,14,47,17],[47,18,47,20],[47,21,47,23],[47,24,47,26],[46,2,46,4],[46,5,46,7],[46,8,46,10],[46,11,46,13],[46,14,46,17],[46,18,46,20],[46,21,46,23],[46,24,46,26],[44,21,44,23],[44,24,44,26],[45,2,45,4],[45,5,45,7],[45,8,45,10],[45,11,45,13],[45,14,45,17],[45,18,45,20],[45,21,45,23],[44,2,44,4],[44,5,44,7],[44,8,44,10],[44,11,44,13],[44,14,44,17],[44,18,44,20],[45,24,45,26],[43,2,43,4],[43,5,43,7],[43,8,43,10],[43,11,43,13],[43,14,43,17],[43,18,43,20],[43,21,43,23],[43,24,43,26],[42,2,42,4],[42,5,42,7],[42,8,42,10],[42,11,42,13],[42,14,42,17],[42,18,42,20],[42,21,42,23],[42,24,42,26],[40,21,40,23],[40,24,40,26],[41,2,41,4],[41,5,41,7],[41,8,41,10],[41,11,41,13],[41,14,41,17],[41,18,41,20],[41,21,41,23],[40,2,40,4],[40,5,40,7],[40,8,40,10],[40,11,40,13],[40,14,40,17],[40,18,40,20],[41,24,41,26],[39,2,39,4],[39,5,39,7],[39,8,39,10],[39,11,39,13],[39,14,39,17],[39,18,39,20],[39,21,39,23],[39,24,39,26],[38,2,38,4],[38,5,38,7],[38,8,38,10],[38,11,38,13],[38,14,38,17],[38,18,38,20],[38,21,38,23],[38,24,38,26],[36,21,36,23],[36,24,36,26],[37,2,37,4],[37,5,37,7],[37,8,37,10],[37,11,37,13],[37,14,37,17],[37,18,37,20],[37,21,37,23],[36,2,36,4],[36,5,36,7],[36,8,36,10],[36,11,36,13],[36,14,36,17],[36,18,36,20],[37,24,37,26],[35,2,35,4],[35,5,35,7],[35,8,35,10],[35,11,35,13],[35,14,35,17],[35,18,35,20],[35,21,35,23],[35,24,35,26],[34,2,34,4],[34,5,34,7],[34,8,34,10],[34,11,34,13],[34,14,34,17],[34,18,34,20],[34,21,34,23],[34,24,34,26],[32,21,32,23],[32,24,32,26],[33,2,33,4],[33,5,33,7],[33,8,33,10],[33,11,33,13],[33,14,33,17],[33,18,33,20],[33,21,33,23],[32,2,32,4],[32,5,32,7],[32,8,32,10],[32,11,32,13],[32,14,32,17],[32,18,32,20],[33,24,33,26],[31,2,31,4],[31,5,31,7],[31,8,31,10],[31,11,31,13],[31,14,31,17],[31,18,31,20],[31,21,31,23],[31,24,31,26],[30,2,30,4],[30,5,30,7],[30,8,30,10],[30,11,30,13],[30,14,30,17],[30,18,30,20],[30,21,30,23],[30,24,30,26],[17,2,17,56],[16,2,16,56],[8,53,8,56],[9,1,9,11],[9,13,9,14],[27,27,27,56],[25,2,25,56],[23,3,23,56],[24,4,24,56],[22,3,22,56],[21,3,21,56],[19,2,19,56],[20,2,20,56],[18,2,18,56],[27,1,29,1],[27,2,29,4],[27,5,29,7],[27,8,29,10],[27,11,29,13],[27,14,29,17],[27,18,29,20],[27,21,29,23],[27,24,29,26],[28,35,28,42]]}
[null,"CENSO NACIONAL DE GOBIERNOS\nESTATALES 2023"]
[]
[null,"Módulo 7. \nCatastro, registro y territorio"]
[]
[null,"Sección II. Registro Público de la Propiedad"]
[]
[null,"Participantes\n(Registrar a las personas servidoras públicas y áreas que participaron en la integración de la información y/o en el llenado de los reactivos que se solicitan en la presente sección. En caso de que las personas servidoras públicas registradas como informantes básico y complementarios hayan integrado información, o llenado algunas preguntas, también deben registrarse en el presente apartado)"]
[]
[null,"Entidad:",null,null,null,null,null,null,null,null,null,null,null,"Clave:",null,null,null,null,null,null,null,null,null,null,null,null,null,null,null,null,null,null,null,null,null,null,null,null,null,null,null,null,null,null,null,null,null,null,null,null,null,null,null,"Índice"]
[null,{"$f":"IF(Presentación!B10=\"\",\"\",Presentación!B10)","v":"Veracruz de Ignacio de la Llave"},null,null,null,null,null,null,null,null,null,null,null,{"$f":"Presentación!N10","v":"30"}]
[]
[null,"Personas servidoras públicas que participaron en el llenado de la sección"]
[null,"Instrucciones de llenado:"]
[null,null,"Título: anotar el grado escolar o el formalismo para referirse a la persona participante: Licenciado(a), Maestro(a), Doctor(a), Ingeniero(a), Ciudadano(a), Señor(a), etcétera."]
[null,null,"Nombre, primer y segundo apellido: escribir los datos completos, sin abreviaturas y con acentos."]
[null,null,"Unidad administrativa de adscripción: incluir el nombre completo de la unidad administrativa o área, tal como aparece en su estructura orgánica."]
[null,null,"Cargo o puesto: incluir el nombre completo del cargo o puesto desempeñado."]
[null,null,"Correo electrónico: registrar preferentemente el correo institucional de la persona participante, evitando cuentas genéricas o personales."]
[null,null,"Sección y/o preguntas en las que participó: registrar la sección, subsección, apartado, subapartado y/o preguntas en las que participó, conforme a lo siguiente:"]
[null,null,"a) Para referirse a preguntas individuales, anotar el número de la pregunta anteponiendo la letra \"P\", separando con coma en caso de ser varias preguntas. Ejemplo: P1.1, P1.3, P1.8.\nb) Si participó en el llenado de todo el cuestionario, anotar la palabra \"Todas\".\nc) Si participó en el llenado de todas las preguntas de una sección, subsección, apartado y/o subapartado, anotar la nomenclatura correspondiente, separando con comas en caso de que sean dos o más. Ejemplo: I, I.2, I.3.1, I.4.1.1.\nd) En caso de que su participación incluya secciones, subsecciones, apartados o subapartados completos, así como algunas preguntas específicas, anotar de forma combinada. Ejemplo: I, II.2, I.4.2, P1.25, P1.26."]
[null,null,"Principales fuentes de información utilizadas para la integración de información proporcionada:"]
[null,null,null,"- Por fuente principal debe considerarse la fuente con la cual se genera toda o la mayor cantidad de información proporcionada, mientras que por fuentes secundarias debe considerar aquellas de las cuales se obtiene el resto de información (cuando hay más de una fuente)."]
[null,null,null,"- En la columna Nombre de la fuente debe anotar el nombre o descripción de la fuente principal y, en su caso, de las secundarias a partir de la(s) cual(es) se obtiene la información requerida en el presente instrumento de captación, y que la persona participante proporcionó. "]
[null,null,null,"- En la columna Tipo de fuente debe clasificar esa fuente según los tipos establecidos en el catálogo siguiente, con base en las características que más se adapten a la fuente utilizada (seleccionar de la lista desplegable el tipo): "]
[null,null,null,null,"Sistema informático propio: corresponde a una solución informática que haya sido desarrollada de manera específica para los fines de la institución, ya sea de forma interna o por un tercero, y tenga el propósito de almacenar o procesar la información generada o utilizada por la institución.\nSoftware comercial especializado: se refiere a algún programa o plataforma comercial diseñada o gestionada por un tercero ajeno a la institución, que sirve para los fines de almacenamiento y procesamiento de su información, sin ser un desarrollo exclusivo para la misma.\nBase de datos u hojas de cálculo estructuradas y estandarizadas: se refiere a la existencia de bases de datos, tablas o conjunto de datos planos que se encuentran estructurados y estandarizados, permitiendo su explotación o consulta a través de softwares estadísticos o de bases de datos (incluye tablas dinámicas, programación de macros en VBA, formularios y BD en Access o similares).\nHojas de cálculo no estructuradas o no estandarizadas: corresponde a que la fuente de información son libros u hojas de Excel que concentran información generada por la institución y es consultada de forma directa sin posibilidad de hacer consultas de forma masiva o de un conjunto de datos. \nLibro de gobierno en formato electrónico: corresponde a los libros o documentos en formato electrónico que se organizan conforme a lineamientos específicos y cuentan con formalidades como foliación, firmas, sellos o autorizaciones, etcétera, que contienen los registros de los procesos o actividades sustantivas del área o institución que genera la información.\nLibro de gobierno en papel: corresponde a los libros o documentos físicos que se organizan conforme a lineamientos específicos y cuentan con formalidades como foliación, firmas, sellos o autorizaciones, etcétera, que contienen los registros de los procesos o actividades sustantivas del área o institución que genera la información.\nBitácora en documento de texto electrónico: se refiere al registro o fuente en la que la información contenida está registrada en documentos electrónicos sin la formalidad de un libro de gobierno y que se utiliza para las actividades cotidianas del área o institución que proporciona la información.\nBitácora en documento de texto en papel: se refiere al registro o fuente en la que la información contenida está registrada en documentos físicos sin la formalidad de un libro de gobierno y que se utiliza para las actividades cotidianas del área o institución que proporciona la información.\nDe palabra: corresponde a cuando no existe una documentación o registro físico o electrónico y la información se obtiene \"de palabra\", es decir, la información se obtiene directamente de las personas involucradas en las actividades (ellas son la fuente) y está supeditada a la memoria de las personas servidoras públicas, no existiendo evidencia documental de lo reportado.\nOtra: se debe seleccionar cuando ninguno de los tipos de fuente listados anteriormente responde a las características de la fuente o medio de registro que es utilizado por el área o institución participante para el registro de la información proporcionada en este instrumento de captación."]
[null,null,"En caso de que seleccione en la categoría \"Otra\" en alguna de las columnas \"Tipo de fuente\", favor de especificar ese otro tipo de fuente(s) en la columna \"Comentarios o especificaciones sobre el tipo de fuente\"."]
[]
[null,"No. ","Título",null,null,"Nombre(s)",null,null,"Primer apellido",null,null,"Segundo apellido",null,null,"Unidad administrativa de adscripción ",null,null,null,"Cargo o puesto ",null,null,"Correo electrónico",null,null,"Sección y/o preguntas en las que participó",null,null,"Principales fuentes utilizadas para la integración de la información proporcionada"]
[null,null,null,null,null,null,null,null,null,null,null,null,null,null,null,null,null,null,null,null,null,null,null,null,null,null,null,"Fuente principal",null,null,null,null,null,null,null,"Fuente secundaria 1",null,null,null,null,null,null,null,"Fuente secundaria 2",null,null,null,null,null,null,null,"Comentarios o especificaciones sobre el tipo de fuente"]
[null,null,null,null,null,null,null,null,null,null,null,null,null,null,null,null,null,null,null,null,null,null,null,null,null,null,null,"Nombre de la fuente",null,null,null,"Tipo de fuente",null,null,null,"Nombre de la fuente",null,null,null,"Tipo de fuente",null,null,null,"Nombre de la fuente",null,null,null,"Tipo de fuente"]
[null,"Ej.","Licenciada",null,null,"Guadalupe",null,null,"Hernández",null,null,"García",null,null,"Dirección General de Administración",null,null,null,"Directora de Recursos Financieros",null,null,"hernandezg@dgsp.gob.mx",null,null,"I, II.2, I.4.2, P1.25, P1.26",null,null,"Control de nómina",null,null,null,"Base de datos u hojas de cálculo estructuradas y estandarizadas",null,null,null,"Sistema de control financiero",null,null,null,"Sistema Informático propio",null,null,null,"Control de nómina",null,null,null,"Hojas de cálculo  no estructuradas o no estandarizadas"]
[null,"1.",null,null,null,null,null,null,null,null,null,null,null,null,null,null,null,null,null,null,null,null,null,null,null,null,null,null,null,null,null,null,null,null,null,null,null,null,null,null,null,null,null,null,null,null,null,null,null,null,null,null,null,null,null,null,null,null,1,"Sistema Informático propio"]
[null,"2.",null,null,null,null,null,null,null,null,null,null,null,null,null,null,null,null,null,null,null,null,null,null,null,null,null,null,null,null,null,null,null,null,null,null,null,null,null,null,null,null,null,null,null,null,null,null,null,null,null,null,null,null,null,null,null,null,2,"Software comercial especializado"]
[null,"3.",null,null,null,null,null,null,null,null,null,null,null,null,null,null,null,null,null,null,null,null,null,null,null,null,null,null,null,null,null,null,null,null,null,null,null,null,null,null,null,null,null,null,null,null,null,null,null,null,null,null,null,null,null,null,null,null,3,"Base de datos u hojas de cálculo estructuradas y estandarizadas"]
[null,"4.",null,null,null,null,null,null,null,null,null,null,null,null,null,null,null,null,null,null,null,null,null,null,null,null,null,null,null,null,null,null,null,null,null,null,null,null,null,null,null,null,null,null,null,null,null,null,null,null,null,null,null,null,null,null,null,null,4,"Hojas de cálculo no estructuradas o no estandarizadas"]
[null,"5.",null,null,null,null,null,null,null,null,null,null,null,null,null,null,null,null,null,null,null,null,null,null,null,null,null,null,null,null,null,null,null,null,null,null,null,null,null,null,null,null,null,null,null,null,null,null,null,null,null,null,null,null,null,null,null,null,5,"Libro de gobierno en formato electrónico"]
[null,"6.",null,null,null,null,null,null,null,null,null,null,null,null,null,null,null,null,null,null,null,null,null,null,null,null,null,null,null,null,null,null,null,null,null,null,null,null,null,null,null,null,null,null,null,null,null,null,null,null,null,null,null,null,null,null,null,null,6,"Libro de gobierno en papel"]
[null,"7.",null,null,null,null,null,null,null,null,null,null,null,null,null,null,null,null,null,null,null,null,null,null,null,null,null,null,null,null,null,null,null,null,null,null,null,null,null,null,null,null,null,null,null,null,null,null,null,null,null,null,null,null,null,null,null,null,7,"Bitácora en documento de texto electrónico"]
[null,"8.",null,null,null,null,null,null,null,null,null,null,null,null,null,null,null,null,null,null,null,null,null,null,null,null,null,null,null,null,null,null,null,null,null,null,null,null,null,null,null,null,null,null,null,null,null,null,null,null,null,null,null,null,null,null,null,null,8,"Bitácora en documento de texto en papel"]
[null,"9.",null,null,null,null,null,null,null,null,null,null,null,null,null,null,null,null,null,null,null,null,null,null,null,null,null,null,null,null,null,null,null,null,null,null,null,null,null,null,null,null,null,null,null,null,null,null,null,null,null,null,null,null,null,null,null,null,9,"De palabra"]
[null,"10.",null,null,null,null,null,null,null,null,null,null,null,null,null,null,null,null,null,null,null,null,null,null,null,null,null,null,null,null,null,null,null,null,null,null,null,null,null,null,null,null,null,null,null,null,null,null,null,null,null,null,null,null,null,null,null,null,10,"Otra"]
[null,"11."]
[null,"12."]
[null,"13."]
[null,"14."]
[null,"15."]
[null,"16."]
[null,"17."]
[null,"18."]
[null,"19."]
[null,"20."]
[null,"21."]
[null,"22."]
[null,"23."]
[null,"24."]
[null,"25."]
[null,"26."]
[null,"27."]
[null,"28."]
[null,"29."]
[null,"30."]
[null,"31."]
[null,"32."]
[null,"33."]
[null,"34."]
[null,"35."]

{"sheet":"CNGE_2023_M7_Secc2","index":4,"n_rows":1937,"n_cols":40,"rows_kept":1937,"cut":false,"hidden":false,"merged":[[1526,2,1526,29],[1525,2,1525,29],[1005,2,1005,29],[1006,2,1007,9],[1006,10,1006,29],[1007,10,1007,13],[1007,14,1007,17],[1007,18,1007,21],[1007,22,1007,25],[1007,26,1007,29],[934,2,934,29],[935,2,935,29],[942,1,942,29],[943,2,943,29],[944,2,944,29],[975,2,975,29],[987,1,987,29],[988,2,988,29],[989,2,989,29],[991,2,991,7],[1001,1,1001,29],[1002,2,1002,29],[977,7,977,8],[979,2,979,29],[980,2,980,29],[963,26,963,29],[965,2,965,29],[966,2,966,29],[973,1,973,29],[974,2,974,29],[963,2,963,9],[993,2,993,29],[308,21,308,29],[307,21,307,29],[462,3,462,12],[303,2,303,29],[304,3,304,10],[304,12,304,19],[304,21,304,29],[305,3,305,10],[305,12,305,19],[305,21,305,29],[301,2,301,5],[301,6,301,29],[344,3,344,14],[344,15,344,19],[344,20,344,24],[344,25,344,29],[345,3,345,14],[345,15,345,19],[345,20,345,24],[345,25,345,29],[342,3,342,14],[342,15,342,19],[342,20,342,24],[342,25,342,29],[343,3,343,14],[343,15,343,19],[343,20,343,24],[343,25,343,29],[340,3,340,14],[340,15,340,19],[340,20,340,24],[340,25,340,29],[33,3,33,29],[34,3,34,29],[35,3,35,29],[36,3,36,29],[27,1,27,29],[28,2,28,29],[29,2,29,29],[31,3,31,29],[32,3,32,29],[14,2,14,29],[0,1,0,29],[2,1,2,29],[4,1,4,29],[6,26,6,29],[7,1,7,11],[7,13,7,14],[9,1,9,29],[10,2,10,29],[11,2,11,29],[12,2,12,29],[13,2,13,29],[22,1,22,29],[23,2,23,29],[24,2,24,29],[25,2,25,29],[15,2,15,29],[16,2,16,29],[17,2,17,29],[18,2,18,29],[19,2,19,29],[21,1,21,29],[66,2,66,29],[69,2,69,29],[71,2,71,5],[71,6,71,29],[73,2,73,29],[55,2,55,5],[55,6,55,29],[57,2,57,29],[58,2,58,29],[65,1,65,29],[41,2,41,29],[42,2,42,29],[49,1,49,29],[50,2,50,29],[53,2,53,29],[37,3,37,29],[39,2,39,5],[39,6,39,29],[51,2,51,29],[67,2,67,29],[104,2,104,29],[106,3,106,29],[107,3,107,29],[108,3,108,29],[109,3,109,29],[93,2,93,29],[94,2,94,29],[101,1,101,29],[102,2,102,29],[103,2,103,29],[86,3,86,29],[87,3,87,29],[88,3,88,29],[89,3,89,29],[91,2,91,5],[91,6,91,29],[74,2,74,29],[81,1,81,29],[82,2,82,29],[83,2,83,29],[85,3,85,29],[129,2,129,29],[131,2,131,21],[131,22,131,25],[131,26,131,29],[132,3,132,21],[132,22,132,25],[132,26,132,29],[118,2,118,29],[119,2,119,29],[126,1,126,29],[127,2,127,29],[128,2,128,29],[110,3,110,29],[111,3,111,29],[113,3,113,29],[114,3,114,29],[116,2,116,5],[116,6,116,29],[112,3,112,29],[149,2,149,29],[150,2,150,29],[151,2,151,29],[153,3,153,29],[155,2,155,29],[138,2,138,5],[138,6,138,29],[140,2,140,29],[141,2,141,29],[148,1,148,29],[135,3,135,21],[135,22,135,25],[135,26,135,29],[136,3,136,21],[136,22,136,25],[136,26,136,29],[133,3,133,21],[133,22,133,25],[133,26,133,29],[134,3,134,21],[134,22,134,25],[134,26,134,29],[158,25,158,29],[159,3,159,8],[159,9,159,10],[159,11,159,15],[159,17,159,22],[159,23,159,24],[159,25,159,29],[158,3,158,8],[158,9,158,10],[158,11,158,15],[158,17,158,22],[158,23,158,24],[156,25,156,29],[157,3,157,8],[157,9,157,10],[157,11,157,15],[157,17,157,22],[157,23,157,24],[157,25,157,29],[156,3,156,8],[156,9,156,10],[156,11,156,15],[156,17,156,22],[156,23,156,24],[162,25,162,29],[163,3,163,8],[163,9,163,10],[163,11,163,15],[163,17,163,22],[163,23,163,24],[163,25,163,29],[162,3,162,8],[162,9,162,10],[162,11,162,15],[162,17,162,22],[162,23,162,24],[160,25,160,29],[161,3,161,8],[161,9,161,10],[161,11,161,15],[161,17,161,22],[161,23,161,24],[161,25,161,29],[160,3,160,8],[160,9,160,10],[160,11,160,15],[160,17,160,22],[160,23,160,24],[166,25,166,29],[168,2,168,29],[169,2,169,29],[176,2,176,29],[177,2,177,29],[166,3,166,8],[166,9,166,10],[166,11,166,15],[166,17,166,22],[166,23,166,24],[164,25,164,29],[165,3,165,8],[165,9,165,10],[165,11,165,15],[165,17,165,22],[165,23,165,24],[165,25,165,29],[164,3,164,8],[164,9,164,10],[164,11,164,15],[164,17,164,22],[164,23,164,24],[181,25,181,29],[182,3,182,8],[182,9,182,10],[182,11,182,15],[182,17,182,22],[182,23,182,24],[182,25,182,29],[181,3,181,8],[181,9,181,10],[181,11,181,15],[181,17,181,22],[181,23,181,24],[179,2,179,29],[180,3,180,8],[180,9,180,10],[180,11,180,15],[180,17,180,22],[180,23,180,24],[180,25,180,29],[185,25,185,29],[186,3,186,8],[186,9,186,10],[186,11,186,15],[186,17,186,22],[186,23,186,24],[186,25,186,29],[185,3,185,8],[185,9,185,10],[185,11,185,15],[185,17,185,22],[185,23,185,24],[183,25,183,29],[184,3,184,8],[184,9,184,10],[184,11,184,15],[184,17,184,22],[184,23,184,24],[184,25,184,29],[183,3,183,8],[183,9,183,10],[183,11,183,15],[183,17,183,22],[183,23,183,24],[189,25,189,29],[190,3,190,8],[190,9,190,10],[190,11,190,15],[190,17,190,22],[190,23,190,24],[190,25,190,29],[189,3,189,8],[189,9,189,10],[189,11,189,15],[189,17,189,22],[189,23,189,24],[187,25,187,29],[188,3,188,8],[188,9,188,10],[188,11,188,15],[188,17,188,22],[188,23,188,24],[188,25,188,29],[187,3,187,8],[187,9,187,10],[187,11,187,15],[187,17,187,22],[187,23,187,24],[204,25,204,29],[205,3,205,8],[205,9,205,10],[205,11,205,15],[205,17,205,22],[205,23,205,24],[205,25,205,29],[204,3,204,8],[204,9,204,10],[204,11,204,15],[204,17,204,22],[204,23,204,24],[192,2,192,29],[193,2,193,29],[200,2,200,29],[201,2,201,29],[203,2,203,29],[208,25,208,29],[209,3,209,8],[209,9,209,10],[209,11,209,15],[209,17,209,22],[209,23,209,24],[209,25,209,29],[208,3,208,8],[208,9,208,10],[208,11,208,15],[208,17,208,22],[208,23,208,24],[206,25,206,29],[207,3,207,8],[207,9,207,10],[207,11,207,15],[207,17,207,22],[207,23,207,24],[207,25,207,29],[206,3,206,8],[206,9,206,10],[206,11,206,15],[206,17,206,22],[206,23,206,24],[212,25,212,29],[213,3,213,8],[213,9,213,10],[213,11,213,15],[213,17,213,22],[213,23,213,24],[213,25,213,29],[212,3,212,8],[212,9,212,10],[212,11,212,15],[212,17,212,22],[212,23,212,24],[210,25,210,29],[211,3,211,8],[211,9,211,10],[211,11,211,15],[211,17,211,22],[211,23,211,24],[211,25,211,29],[210,3,210,8],[210,9,210,10],[210,11,210,15],[210,17,210,22],[210,23,210,24],[226,2,226,29],[228,2,228,19],[228,20,228,24],[228,25,228,29],[229,3,229,19],[229,20,229,24],[229,25,229,29],[214,25,214,29],[216,2,216,29],[217,2,217,29],[224,1,224,29],[225,2,225,29],[214,3,214,8],[214,9,214,10],[214,11,214,15],[214,17,214,22],[214,23,214,24],[234,3,234,19],[234,20,234,24],[234,25,234,29],[236,3,236,19],[236,20,236,24],[236,25,236,29],[232,3,232,19],[232,20,232,24],[232,25,232,29],[233,3,233,19],[233,20,233,24],[233,25,233,29],[230,3,230,19],[230,20,230,24],[230,25,230,29],[231,3,231,19],[231,20,231,24],[231,25,231,29],[235,3,235,19],[235,20,235,24],[235,25,235,29],[255,1,255,29],[257,2,257,9],[257,10,257,14],[257,15,257,17],[257,18,257,20],[257,21,257,23],[257,24,257,26],[257,27,257,29],[249,1,249,29],[250,2,250,29],[251,2,251,29],[252,2,252,29],[253,2,253,29],[238,2,238,5],[238,6,238,29],[240,2,240,29],[241,2,241,29],[248,1,248,29],[265,2,265,29],[266,3,266,8],[266,10,266,15],[266,17,266,22],[266,24,266,29],[262,3,262,7],[262,10,262,15],[262,17,262,22],[262,24,262,29],[263,10,263,15],[263,17,263,22],[263,24,263,29],[258,24,258,26],[258,27,258,29],[260,2,260,7],[260,9,260,29],[261,3,261,7],[261,10,261,15],[261,17,261,22],[261,24,261,29],[258,3,258,9],[258,10,258,14],[258,15,258,17],[258,18,258,20],[258,21,258,23],[282,3,282,11],[282,12,282,17],[282,18,282,23],[282,24,282,29],[284,2,284,29],[271,2,271,29],[272,2,272,29],[279,1,279,29],[281,12,281,17],[281,18,281,23],[281,24,281,29],[267,3,267,8],[267,10,267,15],[267,17,267,22],[267,23,269,29],[268,3,268,8],[268,10,268,15],[268,17,268,22],[269,3,269,8],[269,10,269,15],[269,17,269,22],[285,2,285,29],[292,1,292,29],[293,2,293,29],[294,2,294,29],[295,2,295,29],[336,2,336,29],[338,2,339,14],[338,15,339,19],[338,20,338,29],[339,20,339,24],[339,25,339,29],[324,4,324,7],[326,2,326,29],[327,2,327,29],[334,1,334,29],[335,2,335,29],[310,2,310,29],[311,2,311,29],[318,1,318,29],[320,2,320,5],[322,4,322,7],[299,3,299,9],[297,10,298,14],[299,10,299,14],[297,15,297,29],[306,3,306,10],[306,12,306,19],[306,21,306,29],[307,3,307,10],[307,12,307,19],[308,3,308,10],[308,12,308,19],[341,3,341,14],[341,15,341,19],[341,20,341,24],[341,25,341,29],[366,2,367,14],[366,15,367,19],[366,20,366,29],[367,20,367,24],[367,25,367,29],[360,2,360,29],[361,2,361,29],[362,2,362,29],[363,2,363,29],[364,2,364,29],[349,2,349,5],[349,6,349,29],[351,2,351,29],[352,2,352,29],[359,1,359,29],[346,3,346,14],[346,15,346,19],[346,20,346,24],[346,25,346,29],[347,15,347,19],[347,20,347,24],[347,25,347,29],[372,15,372,19],[372,20,372,24],[372,25,372,29],[374,2,374,5],[374,6,374,29],[370,3,370,14],[370,15,370,19],[370,20,370,24],[370,25,370,29],[371,3,371,14],[371,15,371,19],[371,20,371,24],[371,25,371,29],[368,3,368,14],[368,15,368,19],[368,20,368,24],[368,25,368,29],[369,3,369,14],[369,15,369,19],[369,20,369,24],[369,25,369,29],[389,3,389,14],[389,15,389,19],[389,20,389,24],[389,25,389,29],[390,3,390,14],[390,15,390,19],[390,20,390,24],[390,25,390,29],[376,2,376,29],[377,2,377,29],[384,1,384,29],[385,2,385,29],[387,2,388,14],[387,15,388,19],[387,20,387,29],[388,20,388,24],[388,25,388,29],[395,3,395,14],[395,15,395,19],[395,20,395,24],[395,25,395,29],[396,3,396,14],[396,15,396,19],[396,20,396,24],[396,25,396,29],[393,3,393,14],[393,15,393,19],[393,20,393,24],[393,25,393,29],[394,3,394,14],[394,15,394,19],[394,20,394,24],[394,25,394,29],[391,3,391,14],[391,15,391,19],[391,20,391,24],[391,25,391,29],[392,3,392,14],[392,15,392,19],[392,20,392,24],[392,25,392,29],[412,3,412,14],[413,15,413,19],[412,20,412,24],[412,25,412,29],[413,3,413,14],[414,15,414,19],[413,20,413,24],[413,25,413,29],[407,1,407,29],[408,2,408,29],[410,2,411,14],[410,15,411,19],[410,20,410,29],[411,20,411,24],[411,25,411,29],[397,15,397,19],[397,20,397,24],[397,25,397,29],[399,2,399,29],[400,2,400,29],[412,15,412,19],[418,3,418,14],[418,15,418,19],[418,20,418,24],[418,25,418,29],[419,3,419,14],[419,15,419,19],[419,20,419,24],[419,25,419,29],[416,3,416,14],[416,15,416,19],[416,20,416,24],[416,25,416,29],[417,3,417,14],[417,15,417,19],[417,20,417,24],[417,25,417,29],[414,3,414,14],[414,20,414,24],[414,25,414,29],[415,3,415,14],[415,15,415,19],[415,20,415,24],[415,25,415,29],[436,2,436,29],[437,2,437,29],[439,2,440,12],[439,13,440,17],[439,18,440,21],[439,22,439,29],[440,22,440,25],[440,26,440,29],[423,2,423,29],[424,2,424,29],[431,1,431,29],[432,2,432,29],[433,2,433,29],[420,3,420,14],[420,15,420,19],[420,20,420,24],[420,25,420,29],[421,15,421,19],[421,20,421,24],[421,25,421,29],[435,2,435,29],[434,2,434,29],[444,3,444,12],[444,13,444,17],[444,18,444,21],[444,22,444,25],[444,26,444,29],[443,3,443,12],[443,13,443,17],[443,18,443,21],[443,22,443,25],[443,26,443,29],[442,3,442,12],[442,13,442,17],[442,18,442,21],[442,22,442,25],[442,26,442,29],[441,3,441,12],[441,13,441,17],[441,18,441,21],[441,22,441,25],[441,26,441,29],[446,26,446,29],[447,2,447,3],[447,4,447,12],[447,13,447,17],[447,18,447,21],[447,22,447,25],[447,26,447,29],[446,2,446,3],[446,4,446,12],[446,13,446,17],[446,18,446,21],[446,22,446,25],[445,3,445,12],[445,13,445,17],[445,18,445,21],[445,22,445,25],[445,26,445,29],[451,3,451,12],[451,13,451,17],[451,18,451,21],[451,22,451,25],[451,26,451,29],[450,3,450,12],[450,13,450,17],[450,18,450,21],[450,22,450,25],[450,26,450,29],[448,26,448,29],[449,2,449,3],[449,4,449,12],[449,13,449,17],[449,18,449,21],[449,22,449,25],[449,26,449,29],[448,2,448,3],[448,4,448,12],[448,13,448,17],[448,18,448,21],[448,22,448,25],[454,3,454,12],[454,13,454,17],[454,18,454,21],[454,22,454,25],[454,26,454,29],[452,26,452,29],[453,2,453,3],[453,4,453,12],[453,13,453,17],[453,18,453,21],[453,22,453,25],[453,26,453,29],[452,2,452,3],[452,4,452,12],[452,13,452,17],[452,18,452,21],[452,22,452,25],[459,3,459,12],[459,13,459,17],[459,18,459,21],[459,22,459,25],[459,26,459,29],[457,26,457,29],[458,3,458,12],[458,13,458,17],[458,22,458,25],[458,26,458,29],[457,2,457,3],[457,4,457,12],[457,13,457,17],[457,18,457,21],[457,22,457,25],[455,26,455,29],[456,2,456,3],[456,4,456,12],[456,13,456,17],[456,18,456,21],[456,22,456,25],[456,26,456,29],[455,2,455,3],[455,4,455,12],[455,13,455,17],[455,18,455,21],[455,22,455,25],[458,18,458,21],[464,18,464,21],[464,22,464,25],[464,26,464,29],[466,2,466,5],[466,6,466,29],[463,3,463,12],[463,13,463,17],[463,18,463,21],[463,22,463,25],[463,26,463,29],[461,3,461,12],[461,13,461,17],[461,18,461,21],[461,22,461,25],[461,26,461,29],[460,3,460,12],[460,13,460,17],[460,18,460,21],[460,22,460,25],[460,26,460,29],[462,13,462,17],[462,18,462,21],[462,22,462,25],[462,26,462,29],[502,1,502,29],[503,2,503,29],[504,2,504,29],[506,2,506,14],[506,15,506,19],[506,20,506,24],[506,25,506,29],[482,2,482,29],[489,1,489,29],[490,2,490,29],[494,2,494,29],[495,2,495,29],[468,2,468,29],[469,2,469,29],[476,1,476,29],[477,2,477,29],[481,2,481,29],[507,25,507,29],[508,4,508,5],[508,6,508,14],[508,15,508,19],[508,20,508,24],[508,25,508,29],[507,2,514,3],[507,4,507,5],[507,6,507,14],[507,15,507,19],[507,20,507,24],[509,4,509,5],[509,6,509,14],[509,15,509,19],[509,20,509,24],[511,4,511,5],[511,6,511,14],[511,15,511,19],[511,20,511,24],[513,4,513,5],[513,6,513,14],[513,15,513,19],[513,20,513,24],[513,25,513,29],[514,4,514,5],[514,6,514,14],[514,15,514,19],[514,20,514,24],[514,25,514,29],[511,25,511,29],[512,4,512,5],[512,6,512,14],[512,15,512,19],[512,20,512,24],[512,25,512,29],[509,25,509,29],[510,4,510,5],[510,6,510,14],[510,15,510,19],[510,20,510,24],[510,25,510,29],[515,25,515,29],[516,4,516,5],[516,6,516,14],[516,15,516,19],[516,20,516,24],[516,25,516,29],[515,4,515,5],[515,6,515,14],[515,15,515,19],[515,20,515,24],[519,25,519,29],[520,4,520,5],[520,6,520,14],[520,15,520,19],[520,20,520,24],[520,25,520,29],[519,4,519,5],[519,6,519,14],[519,15,519,19],[519,20,519,24],[521,4,521,5],[521,6,521,14],[521,15,521,19],[521,20,521,24],[517,25,517,29],[518,4,518,5],[518,6,518,14],[518,15,518,19],[518,20,518,24],[518,25,518,29],[517,4,517,5],[517,6,517,14],[517,15,517,19],[517,20,517,24],[527,2,527,3],[527,4,527,14],[527,15,527,19],[527,20,527,24],[527,25,527,29],[526,2,526,3],[526,4,526,14],[526,15,526,19],[526,20,526,24],[526,25,526,29],[525,4,525,5],[525,6,525,14],[525,15,525,19],[525,20,525,24],[525,25,525,29],[524,4,524,5],[524,6,524,14],[524,15,524,19],[524,20,524,24],[524,25,524,29],[515,2,525,3],[523,4,523,5],[523,6,523,14],[523,15,523,19],[523,20,523,24],[523,25,523,29],[521,25,521,29],[522,4,522,5],[522,6,522,14],[522,15,522,19],[522,20,522,24],[522,25,522,29],[530,25,530,29],[531,4,531,5],[531,6,531,14],[531,15,531,19],[531,20,531,24],[531,25,531,29],[528,25,528,29],[529,4,529,5],[529,6,529,14],[529,15,529,19],[529,20,529,24],[529,25,529,29],[528,2,531,3],[528,4,528,5],[528,6,528,14],[528,15,528,19],[528,20,528,24],[530,4,530,5],[530,6,530,14],[530,15,530,19],[530,20,530,24],[534,25,534,29],[535,4,535,5],[535,6,535,14],[535,15,535,19],[535,20,535,24],[535,25,535,29],[532,25,532,29],[533,4,533,5],[533,6,533,14],[533,15,533,19],[533,20,533,24],[533,25,533,29],[532,2,535,3],[532,4,532,5],[532,6,532,14],[532,15,532,19],[532,20,532,24],[534,4,534,5],[534,6,534,14],[534,15,534,19],[534,20,534,24],[540,2,540,5],[540,6,540,29],[542,2,542,29],[538,2,538,3],[538,4,538,14],[538,15,538,19],[538,20,538,24],[538,25,538,29],[537,2,537,3],[537,4,537,14],[537,15,537,19],[537,20,537,24],[537,25,537,29],[536,2,536,3],[536,4,536,14],[536,15,536,19],[536,20,536,24],[536,25,536,29],[569,3,569,29],[570,3,570,29],[571,3,571,29],[572,3,572,29],[574,2,574,5],[574,6,574,29],[543,2,543,29],[550,1,550,29],[552,1,552,29],[557,3,557,29],[558,3,558,29],[559,3,559,29],[554,2,554,29],[555,2,555,29],[560,3,560,29],[561,3,561,29],[562,3,562,29],[563,3,563,29],[564,3,564,29],[565,3,565,29],[566,3,566,29]],"merged_total":2208,"flags":["merged_cut"]}
[null,"CENSO NACIONAL DE GOBIERNOS\nESTATALES 2023"]
[]
[null,"Módulo 7.\nCatastro, registro y territorio"]
[]
[null,"Sección II. Registro Público de la Propiedad"]
[]
[null,"Entidad:",null,null,null,null,null,null,null,null,null,null,null,"Clave:",null,null,null,null,null,null,null,null,null,null,null,null,"Índice"]
[null,{"$f":"IF(Presentación!B10=\"\",\"\",Presentación!B10)","v":"Veracruz de Ignacio de la Llave"},null,null,null,null,null,null,null,null,null,null,null,{"$f":"Presentación!N10","v":"30"}]
[]
[null,"Instrucciones generales para las preguntas de la sección:",null,null,null,null,null,null,null,null,null,null,null,null,null,null,null,null,null,null,null,null,null,null,null,null,null,null,null,null,null,null,{"$f":"IF(N8=\"\",\"\",VLOOKUP(RIGHT(N8,2),listas!B2:C33,2))","v":212}]
[null,null,"1.- Periodo de referencia de los datos: \nAl cierre del año: la información se refiere a lo existente al 31 de diciembre de 2022.\nDurante el año: la información se refiere a lo existente del 1 de enero al 31 de diciembre de 2022.",null,null,null,null,null,null,null,null,null,null,null,null,null,null,null,null,null,null,null,null,null,null,null,null,null,null,null,null,null,{"$f":"IF(N8=\"\",\"\",\"X\")","v":"X"}]
[null,null,"2.- Los catálogos utilizados en el presente cuestionario corresponden a denominaciones estándar, de tal forma que si el nombre de alguna clasificación no coincide exactamente con la utilizada en su entidad federativa, debe registrar los datos en aquella que sea homóloga. "]
[null,null,"3.- En caso de que los registros con los que cuente no le permitan desglosar la información de acuerdo con los requerimientos solicitados, anote \"NS\" (No se sabe) en las celdas donde no disponga de información. En el recuadro para comentarios de cada pregunta debe proporcionar una justificación respecto del uso del \"NS\" en determinado reactivo."]
[null,null,"4.- En las preguntas en las que conteste con el código \"Otro\", evite la respuesta múltiple en el recuadro destinado para especificar la información. En dicho espacio anote solo una respuesta, la más importante o representativa, y asiente el resto en el recuadro para comentarios de la pregunta."]
[null,null,"5.- Las cifras deben anotarse con números enteros y sin espacio de separación ni comas, independientemente de si son miles o millones. En el caso de los porcentajes, estos además deben de ir sin el símbolo %."]
[null,null,"6.- No deje celdas en blanco, salvo en los casos en que la instrucción así lo solicite. "]
[null,null,"7.- En el caso de las tablas, deben estar contestadas todas las celdas, ya sea anotando \"0\" (cero), en caso de datos numéricos, o eligiendo algún código según el formato de respuesta."]
[null,null,"8.- En las preguntas con listas desplegables, seleccione la opción que corresponda a la realidad de la entidad federativa."]
[null,null,"9.- Antes de concluir el cuestionario, revise que no haya celdas rellenas con rojo, pues dicho color indica que hay error en la información y debe de corregirse. También asegúrese de que no haya celdas con color amarillo, ya que eso significa que falta una respuesta y debe proporcionarse la información.\t"]
[null,null,"10.- ¡Importante!: recuerde que todos los datos proporcionados en el cuestionario deben corresponder a los asentados en sus registros administrativos."]
[]
[null,"II.1 Estructura de la institución registral"]
[null,"Glosario de la subsección:"]
[null,null,"1.- Administración Pública Estatal Centralizada: se refiere al conjunto de instituciones o dependencias de la Administración Pública de la entidad federativa que, de acuerdo con la ley orgánica respectiva, fueron creadas para el despacho de los negocios de orden administrativo encomendados al Poder Ejecutivo Estatal, tales como: la oficina del(a) Gobernador(a) u homóloga, las secretarías, la consejería jurídica u homóloga y las demás instituciones que la disposición normativa en la materia establezca."]
[null,null,"2.- Administración Pública Estatal Descentralizada: se refiere a la entidad de la administración pública creada por ley o decreto del Congreso o por decreto del Ejecutivo estatal, con personalidad jurídica y patrimonio propio, cualquiera que sea la estructura legal que adopten, constituida con fondos o bienes provenientes de la administración pública estatal. Su objetivo es la prestación de un servicio público o social, la explotación de bienes o recursos propiedad del Estado."]
[null,null,"3.- Administración Pública Estatal Desconcentrada: se refiere a las entidades jerárquicamente subordinadas a las instituciones, con facultades específicas para resolver asuntos en la materia encomendada de conformidad con las disposiciones legales aplicables. Los órganos desconcentrados cuentan con autonomía administrativa, pero no tienen responsabilidad jurídica ni patrimonio propio. Es importante señalar que los recursos ejercidos por los órganos administrativos desconcentrados forman parte del gasto del ramo administrativo que los coordina sectorialmente."]
[]
["2.1.-","Seleccione la denominación de la institución registral de la entidad federativa durante el año 2022.",null,null,null,null,null,null,null,null,null,null,null,null,null,null,null,null,null,null,null,null,null,null,null,null,null,null,null,null,null,null,null,null,{"$f":"IF(COUNTBLANK(C32:C38)=7,1,0)","v":1}]
[null,null,"Seleccione con \"X\" un solo código. "]
[null,null,"Si marca el numeral 7, anote la otra denominación en el recuadro que se encuentra al final de la lista."]
[]
[null,null,null,"1. Instituto Registral y Catastral"]
[null,null,null,"2. Instituto Catastral y Registral"]
[null,null,null,"3. Instituto Registral"]
[null,null,null,"4. Dirección de Catastro y Registro Público de la Propiedad y de Comercio"]
[null,null,null,"5. Dirección General de Registro Público de la Propiedad y de Comercio"]
[null,null,null,"6. Dirección de Registro Público de la Propiedad y de Comercio"]
[null,null,null,"7. Otra (especifique)"]
[]
[null,null,"Otra denominación:\n(especifique)",null,null,null,null,null,null,null,null,null,null,null,null,null,null,null,null,null,null,null,null,null,null,null,null,null,null,null,null,null,null,null,{"$f":"IF(UPPER(C41=\"X\"),COUNTBLANK(G43),0)","v":0}]
[]
[null,null,"En caso de tener algún comentario u observación al dato registrado en la respuesta de la presente pregunta, o de los datos que derivan de la misma, favor de anotarlo en el siguiente espacio. De lo contrario, déjelo en blanco."]
[]
[]
[]
[]
[]
[]
[]
["2.2.-","Seleccione de la lista desplegable el nombre oficial del área o institución que realizó exclusivamente la actividad registral en la entidad federativa durante el año 2022."]
[null,null,"Seleccione de la lista desplegable el nombre oficial del área o institución que realizó la actividad registral."]
[null,null,"Si elige la opción \"Otro\", anote el otro nombre oficial en el recuadro que se encuentra después de la lista desplegable."]
[]
[null,null,null,null,null,null,null,null,null,null,null,null,null,null,null,null,null,null,null,null,null,null,null,null,null,null,null,null,null,null,null,null,null,null,{"$f":"COUNTBLANK(C54)","v":1}]
[]
[null,null,"Otro nombre oficial:\n(especifique)",null,null,null,null,null,null,null,null,null,null,null,null,null,null,null,null,null,null,null,null,null,null,null,null,null,null,null,null,null,null,null,{"$f":"IF(UPPER(C54=\"OTRO\"),COUNTBLANK(G56),0)","v":0}]
[]
[null,null,"En caso de tener algún comentario u observación al dato registrado en la respuesta de la presente pregunta, o de los datos que derivan de la misma, favor de anotarlo en el siguiente espacio. De lo contrario, déjelo en blanco."]
[]
[]
[]
[]
[]
[]
[]
["2.3.-","Seleccione de la lista desplegable el nombre oficial de la institución a la que estuvo adscrita durante el año 2022 el área o institución que seleccionó en la pregunta 2.2."]
[null,null,"Seleccione de la lista desplegable el nombre oficial de la institución a la que estuvo adscrita el área o institución que realizó la actividad registral."]
[null,null,"Si elige la opción \"Otro\", anote el otro nombre oficial en el recuadro que se encuentra después de la lista desplegable."]
[]
[null,null,null,null,null,null,null,null,null,null,null,null,null,null,null,null,null,null,null,null,null,null,null,null,null,null,null,null,null,null,null,null,null,null,{"$f":"COUNTBLANK(C70)","v":1}]
[]
[null,null,"Otro nombre oficial:\n(especifique)",null,null,null,null,null,null,null,null,null,null,null,null,null,null,null,null,null,null,null,null,null,null,null,null,null,null,null,null,null,null,null,{"$f":"IF(UPPER(C70=\"OTRO\"),COUNTBLANK(G72),0)","v":0}]
[]
[null,null,"En caso de tener algún comentario u observación al dato registrado en la respuesta de la presente pregunta, o de los datos que derivan de la misma, favor de anotarlo en el siguiente espacio. De lo contrario, déjelo en blanco."]
[]
[]
[]
[]
[]
[]
[]
["2.4.-","Seleccione la clasificación administrativa que tuvo la institución registral de la entidad federativa durante el año 2022.",null,null,null,null,null,null,null,null,null,null,null,null,null,null,null,null,null,null,null,null,null,null,null,null,null,null,null,null,null,null,null,null,{"$f":"IF(COUNTBLANK(C86:C90)=5,1,0)","v":1}]
[null,null,"Seleccione con \"X\" un solo código."]
[null,null,"Si marca el numeral 4, anote la otra clasificación administrativa en el recuadro que se encuentra al final de la lista."]
[]
[null,null,null,"1. Desconcentrada"]
[null,null,null,"2. Descentralizada"]
[null,null,null,"3. Centralizada"]
[null,null,null,"4. Otra (especifique)"]
[null,null,null,"9. No se sabe"]
[]
[null,null,"Otra clasificación administrativa:\n(especifique)",null,null,null,null,null,null,null,null,null,null,null,null,null,null,null,null,null,null,null,null,null,null,null,null,null,null,null,null,null,null,null,{"$f":"IF(UPPER(C89=\"X\"),COUNTBLANK(G92),0)","v":0}]
[null,null,null,null,null," "]
[null,null,"En caso de tener algún comentario u observación al dato registrado en la respuesta de la presente pregunta, o de los datos que derivan de la misma, favor de anotarlo en el siguiente espacio. De lo contrario, déjelo en blanco."]
[]
[]
[]
[]
[]
[]
[]
["2.5.-","Seleccione las actividades que registró la institución registral de la entidad federativa durante el año 2022.",null,null,null,null,null,null,null,null,null,null,null,null,null,null,null,null,null,null,null,null,null,null,null,null,null,null,null,null,null,null,null,null,{"$f":"IF(COUNTBLANK(C107:C115)=9,1,0)","v":1}]
[null,null,"Puede seleccionar con \"X\" más de un código."]
[null,null,"Si marca el numeral 8, anote la otra actividad en el recuadro que se encuentra al final de la lista."]
[null,null,"Si elige el numeral 9, no marque otro código."]
[]
[null,null,null,"1. Inmobiliaria"]
[null,null,null,"2. Mercantil"]
[null,null,null,"3. Mobiliaria"]
[null,null,null,"4. Personas morales de carácter civil"]
[null,null,null,"5. Testamentaria "]
[null,null,null,"6. Desarrollo urbano "]
[null,null,null,"7. Notarial"]
[null,null,null,"8. Otra (especifique)"]
[null,null,null,"9. No se sabe"]
[]
[null,null,"Otra actividad:\n(especifique)",null,null,null,null,null,null,null,null,null,null,null,null,null,null,null,null,null,null,null,null,null,null,null,null,null,null,null,null,null,null,null,{"$f":"IF(UPPER(C114=\"X\"),COUNTBLANK(G117),0)","v":0}]
[]
[null,null,"En caso de tener algún comentario u observación al dato registrado en la respuesta de la presente pregunta, o de los datos que derivan de la misma, favor de anotarlo en el siguiente espacio. De lo contrario, déjelo en blanco."]
[null,null,null,null,null,null,null,null,null,null,null,null,null,null,null,null,null,null,null,null,null,null,null,null,null,null,null,null,null,null,null,null,null,null,null,{"$f":"IF(AK120=1,COUNTBLANK(C120),0)","v":0},0]
[]
[]
[]
[]
[]
[]
["2.6.-","Indique si al cierre del año 2022 existieron las siguientes oficinas registrales en la entidad federativa.",null,null,null,null,null,null,null,null,null,null,null,null,null,null,null,null,null,null,null,null,null,null,null,null,null,null,null,null,null,null,null,null,{"$f":"IF(AND(W133=1,AA133=\"\"),1,0)+IF(AND(W134=1,AA134=\"\"),1,0)+IF(AND(W135=1,AA135=\"\"),1,0)+IF(AND(W136=1,AA136=\"\"),1,0)+IF(AND(W137=1,AA137=\"\"),1,0)+COUNTBLANK(W133:W137)","v":5}]
[null,null,"Si responde \"1. Sí\" en el numeral \"1. Únicamente oficina registral estatal\", responda \"2. No\" en los numerales 2 a 5 y pase a la pregunta 2.9."]
[null,null,"Para la clasificación de las oficinas registrales se utilizan las denominaciones estándar \"Oficinas en las cabeceras regionales\" y \"Oficinas en las cabeceras de distritos judiciales\", por lo que si el nombre no coincide exactamente con las oficinas existentes en su institución registral, debe registrar los datos en aquella que sea homóloga. "]
[null,null,"Si responde \"1. Sí\" en el numeral 5, anote el otro tipo de oficina en el recuadro que se encuentra al final de la tabla."]
[]
[null,null,"Tipo de oficina",null,null,null,null,null,null,null,null,null,null,null,null,null,null,null,null,null,null,null,"¿Existieron? \n(1.Sí / 2.No / \n9.No se sabe)",null,null,null,"Cantidad"]
[null,null,"1.","Únicamente oficina registral estatal"]
[null,null,"2.","Oficina central",null,null,null,null,null,null,null,null,null,null,null,null,null,null,null,null,null,null,null,null,null,null,null,null,null,null,null,null,{"$f":"IF(W134=1,AG10,0)","v":0}]
[null,null,"3.","Oficinas en las cabeceras regionales",null,null,null,null,null,null,null,null,null,null,null,null,null,null,null,null,null,null,null,null,null,null,null,null,null,null,null,null,{"$f":"IF(W135=1,AG10,0)","v":0}]
[null,null,"4.","Oficinas en las cabeceras de distritos judiciales",null,null,null,null,null,null,null,null,null,null,null,null,null,null,null,null,null,null,null,null,null,null,null,null,null,null,null,null,{"$f":"IF(W136=1,AG10,0)","v":0}]
[null,null,"5.","Otro (especifique)"]
[]
[null,null,"Otro tipo de oficina:\n(especifique)",null,null,null,null,null,null,null,null,null,null,null,null,null,null,null,null,null,null,null,null,null,null,null,null,null,null,null,null,null,{"$f":"IF(W134=1,AG10,0)","v":0},null,{"$f":"IF(W137=1,COUNTBLANK(G139),0)","v":0}]
[null,null,null,null,null,null,null,null,null,null,null,null,null,null,null,null,null,null,null,null,null,null,null,null,null,null,null,null,null,null,null,null,{"$f":"IF(W135=1,AG10,0)","v":0}]
[null,null,"En caso de tener algún comentario u observación al dato registrado en la respuesta de la presente pregunta, o de los datos que derivan de la misma, favor de anotarlo en el siguiente espacio. De lo contrario, déjelo en blanco.",null,null,null,null,null,null,null,null,null,null,null,null,null,null,null,null,null,null,null,null,null,null,null,null,null,null,null,null,null,{"$f":"IF(W136=1,AG10,0)","v":0}]
[]
[]
[]
[null,null,null,null,null,null,null,null,null,null,null,null,null,null,null,null,null,null,null,null,null,null,null,null,null,null,null,null,null,null,null,null,0]
[]
[]
[]
["2.7.-","Si respondió afirmativamente en el numeral 2, 3 y/o 4 de la pregunta 2.6, anote el nombre de la oficina y elija los municipios que fueron atendidos en su jurisdicción.  ",null,null,null,null,null,null,null,null,null,null,null,null,null,null,null,null,null,null,null,null,null,null,null,null,null,null,null,null,null,null,{"$f":"IF(OR(C154=\"X\",C154=\"x\"),2,W134)","v":0},{"$f":"IF(AH150>=AA134,0,1)","v":0},{"$f":"IF(UPPER(C154)=\"X\",0,(COUNTBLANK('Complemento 1'!L16:L290)+COUNTBLANK('Complemento 1'!Z16:Z290)+COUNTBLANK(L158:L167)+COUNTBLANK(Z158:Z167)-(570-AG134))+(COUNTBLANK('Complemento 1'!D16:D290)+COUNTBLANK('Complemento 1'!R16:R290)+COUNTBLANK(D158:D167)+COUNTBLANK(R158:R167)-(570-AG134)))","v":0}]
[null,null,"Si la oficina central no atendió municipios, sino que fungió como oficina de coordinación, seleccione con \"X\" el código 2.",null,null,null,null,null,null,null,null,null,null,null,null,null,null,null,null,null,null,null,null,null,null,null,null,null,null,null,null,null,{"$f":"COUNTBLANK(D158)+COUNTBLANK(J158)+COUNTBLANK(L158)","v":3},{"$f":"(COUNTIF(D158:D167,\"<>\"&\"\")+COUNTIF(R158:R167,\"<>\"&\"\")+COUNTIF('Complemento 1'!D16:D290,\"<>\"&\"\")+COUNTIF('Complemento 1'!R16:R290,\"<>\"&\"\"))","v":0}]
[null,null,"Si la oficina central atendió municipios, registre el nombre de la oficina central por cada municipio que esté bajo su jurisdicción."]
[null,null,"Si requiere de más filas para registrar a los municipios que se encuentran bajo jurisdicción de la oficina central, seleccione los faltantes en la tabla de la hoja \"Complemento 1\"."]
[]
[null,null,null,"2. La oficina central no atendió municipios, fue oficina de coordinación"]
[]
[null,null,"Municipios/demarcaciones territoriales atendidos por la oficina central"]
[null,null,"No","Nombre de la oficina central",null,null,null,null,null,"Clave",null,"Municipio/\ndemarcación territorial",null,null,null,null,"No","Nombre de la oficina central",null,null,null,null,null,"Clave",null,"Municipio/\ndemarcación territorial"]
[null,null,"1.",null,null,null,null,null,null,{"$f":"IF(ISBLANK(L158),\"\",VLOOKUP(L158,INDIRECT(CONCATENATE(\"LC_\",RIGHT($N$8,2))),2,FALSE))","v":""},null,null,null,null,null,null,"11.",null,null,null,null,null,null,{"$f":"IF(ISBLANK(Z158),\"\",VLOOKUP(Z158,INDIRECT(CONCATENATE(\"LC_\",RIGHT($N$8,2))),2,FALSE))","v":""}]
[null,null,"2.",null,null,null,null,null,null,{"$f":"IF(ISBLANK(L159),\"\",VLOOKUP(L159,INDIRECT(CONCATENATE(\"LC_\",RIGHT($N$8,2))),2,FALSE))","v":""},null,null,null,null,null,null,"12.",null,null,null,null,null,null,{"$f":"IF(ISBLANK(Z159),\"\",VLOOKUP(Z159,INDIRECT(CONCATENATE(\"LC_\",RIGHT($N$8,2))),2,FALSE))","v":""}]
[null,null,"3.",null,null,null,null,null,null,"",null,null,null,null,null,null,"13.",null,null,null,null,null,null,""]
[null,null,"4.",null,null,null,null,null,null,"",null,null,null,null,null,null,"14.",null,null,null,null,null,null,""]
[null,null,"5.",null,null,null,null,null,null,"",null,null,null,null,null,null,"15.",null,null,null,null,null,null,""]
[null,null,"6.",null,null,null,null,null,null,"",null,null,null,null,null,null,"16.",null,null,null,null,null,null,""]
[null,null,"7.",null,null,null,null,null,null,"",null,null,null,null,null,null,"17.",null,null,null,null,null,null,""]
[null,null,"8.",null,null,null,null,null,null,"",null,null,null,null,null,null,"18.",null,null,null,null,null,null,""]
[null,null,"9.",null,null,null,null,null,null,"",null,null,null,null,null,null,"19.",null,null,null,null,null,null,""]
[null,null,"10.",null,null,null,null,null,null,"",null,null,null,null,null,null,"20.",null,null,null,null,null,null,""]
[null,null,null,null,null,null,null,null,null,null,null,null,null,null,null,null,null,null,null,null,null,null,null,null,null,null,null,null,null,null,null,null,0]
[null,null,"En caso de tener algún comentario u observación al dato registrado en la respuesta de la presente pregunta, o de los datos que derivan de la misma, favor de anotarlo en el siguiente espacio. De lo contrario, déjelo en blanco."]
[]
[]
[]
[]
[]
[]
[]
[null,null,"Registre el nombre de las oficinas en las cabeceras regionales por cada municipio que esté bajo su jurisdicción."]
[null,null,"Si requiere de más filas para registrar a los municipios que se encuentran bajo jurisdicción de oficinas en las cabeceras regionales, seleccione los faltantes en la tabla de la hoja \"Complemento 2\"."]
[]
[null,null,"Municipios/demarcaciones territoriales atendidos por oficinas en las cabeceras regionales",null,null,null,null,null,null,null,null,null,null,null,null,null,null,null,null,null,null,null,null,null,null,null,null,null,null,null,null,null,0,{"$f":"IF(AH181>=AA135,0,1)","v":0},{"$f":"(COUNTBLANK('Complemento 2'!L43:L317)+COUNTBLANK('Complemento 2'!Z43:Z317)+COUNTBLANK(L182:L191)+COUNTBLANK(Z182:Z191)-(570-AG135))+(COUNTBLANK('Complemento 2'!D43:D317)+COUNTBLANK('Complemento 2'!R43:R317)+COUNTBLANK(D182:D191)+COUNTBLANK(R182:R191)-(570-AG135))","v":0}]
[null,null,"No","Nombre de la oficina en la cabecera regional",null,null,null,null,null,"Clave",null,"Municipio/\ndemarcación territorial",null,null,null,null,"No","Nombre de la oficina en la cabecera regional",null,null,null,null,null,"Clave",null,"Municipio/\ndemarcación territorial",null,null,null,null,null,null,null,{"$f":"(COUNTIF(D182:D191,\"<>\"&\"\")+COUNTIF(R182:R191,\"<>\"&\"\")+COUNTIF('Complemento 2'!D16:D290,\"<>\"&\"\")+COUNTIF('Complemento 2'!R16:R290,\"<>\"&\"\"))","v":0}]
[null,null,"1.",null,null,null,null,null,null,{"$f":"IF(ISBLANK(L182),\"\",VLOOKUP(L182,INDIRECT(CONCATENATE(\"LC_\",RIGHT($N$8,2))),2,FALSE))","v":""},null,null,null,null,null,null,"11.",null,null,null,null,null,null,{"$f":"IF(ISBLANK(Z182),\"\",VLOOKUP(Z182,INDIRECT(CONCATENATE(\"LC_\",RIGHT($N$8,2))),2,FALSE))","v":""}]
[null,null,"2.",null,null,null,null,null,null,{"$f":"IF(ISBLANK(L183),\"\",VLOOKUP(L183,INDIRECT(CONCATENATE(\"LC_\",RIGHT($N$8,2))),2,FALSE))","v":""},null,null,null,null,null,null,"12.",null,null,null,null,null,null,{"$f":"IF(ISBLANK(Z183),\"\",VLOOKUP(Z183,INDIRECT(CONCATENATE(\"LC_\",RIGHT($N$8,2))),2,FALSE))","v":""}]
[null,null,"3.",null,null,null,null,null,null,"",null,null,null,null,null,null,"13.",null,null,null,null,null,null,""]
[null,null,"4.",null,null,null,null,null,null,"",null,null,null,null,null,null,"14.",null,null,null,null,null,null,""]
[null,null,"5.",null,null,null,null,null,null,"",null,null,null,null,null,null,"15.",null,null,null,null,null,null,""]
[null,null,"6.",null,null,null,null,null,null,"",null,null,null,null,null,null,"16.",null,null,null,null,null,null,""]
[null,null,"7.",null,null,null,null,null,null,"",null,null,null,null,null,null,"17.",null,null,null,null,null,null,""]
[null,null,"8.",null,null,null,null,null,null,"",null,null,null,null,null,null,"18.",null,null,null,null,null,null,""]
[null,null,"9.",null,null,null,null,null,null,"",null,null,null,null,null,null,"19.",null,null,null,null,null,null,""]
[null,null,"10.",null,null,null,null,null,null,"",null,null,null,null,null,null,"20.",null,null,null,null,null,null,""]
[]
[null,null,"En caso de tener algún comentario u observación al dato registrado en la respuesta de la presente pregunta, o de los datos que derivan de la misma, favor de anotarlo en el siguiente espacio. De lo contrario, déjelo en blanco."]
[]
[]
[]
[]
[]
[]
[]
[null,null,"Registre el nombre de las oficinas en las cabeceras de distritos judiciales por cada municipio que esté bajo su jurisdicción."]
[null,null,"Si requiere de más filas para registrar a los municipios que se encuentran bajo jurisdicción de oficinas en las cabeceras de distritos judiciales, seleccione los faltantes en la tabla de la hoja \"Complemento 3\"."]
[]
[null,null,"Municipios/demarcaciones territoriales atendidos por oficinas en las cabeceras de distritos judiciales",null,null,null,null,null,null,null,null,null,null,null,null,null,null,null,null,null,null,null,null,null,null,null,null,null,null,null,null,null,0,{"$f":"IF(AH205>=AA136,0,1)","v":0},{"$f":"(COUNTBLANK('Complemento 3'!L67:L341)+COUNTBLANK('Complemento 3'!Z67:Z341)+COUNTBLANK(L206:L215)+COUNTBLANK(Z206:Z215)-(570-AG136))+(COUNTBLANK('Complemento 3'!D67:D341)+COUNTBLANK('Complemento 3'!R67:R341)+COUNTBLANK(D206:D215)+COUNTBLANK(R206:R215)-(570-AG136))","v":0}]
[null,null,"No","Nombre de la oficina en la cabecera de distrito judicial",null,null,null,null,null,"Clave",null,"Municipio/\ndemarcación territorial",null,null,null,null,"No","Nombre de la oficina en la cabecera de distrito judicial",null,null,null,null,null,"Clave",null,"Municipio/\ndemarcación territorial",null,null,null,null,null,null,null,{"$f":"(COUNTIF(D206:D215,\"<>\"&\"\")+COUNTIF(R206:R215,\"<>\"&\"\")+COUNTIF('Complemento 3'!D16:D290,\"<>\"&\"\")+COUNTIF('Complemento 3'!R16:R290,\"<>\"&\"\"))","v":0}]
[null,null,"1.",null,null,null,null,null,null,{"$f":"IF(ISBLANK(L206),\"\",VLOOKUP(L206,INDIRECT(CONCATENATE(\"LC_\",RIGHT($N$8,2))),2,FALSE))","v":""},null,null,null,null,null,null,"11.",null,null,null,null,null,null,{"$f":"IF(ISBLANK(Z206),\"\",VLOOKUP(Z206,INDIRECT(CONCATENATE(\"LC_\",RIGHT($N$8,2))),2,FALSE))","v":""}]
[null,null,"2.",null,null,null,null,null,null,{"$f":"IF(ISBLANK(L207),\"\",VLOOKUP(L207,INDIRECT(CONCATENATE(\"LC_\",RIGHT($N$8,2))),2,FALSE))","v":""},null,null,null,null,null,null,"12.",null,null,null,null,null,null,{"$f":"IF(ISBLANK(Z207),\"\",VLOOKUP(Z207,INDIRECT(CONCATENATE(\"LC_\",RIGHT($N$8,2))),2,FALSE))","v":""}]
[null,null,"3.",null,null,null,null,null,null,"",null,null,null,null,null,null,"13.",null,null,null,null,null,null,""]
[null,null,"4.",null,null,null,null,null,null,"",null,null,null,null,null,null,"14.",null,null,null,null,null,null,""]
[null,null,"5.",null,null,null,null,null,null,"",null,null,null,null,null,null,"15.",null,null,null,null,null,null,""]
[null,null,"6.",null,null,null,null,null,null,"",null,null,null,null,null,null,"16.",null,null,null,null,null,null,""]
[null,null,"7.",null,null,null,null,null,null,"",null,null,null,null,null,null,"17.",null,null,null,null,null,null,""]
[null,null,"8.",null,null,null,null,null,null,"",null,null,null,null,null,null,"18.",null,null,null,null,null,null,""]
[null,null,"9.",null,null,null,null,null,null,"",null,null,null,null,null,null,"19.",null,null,null,null,null,null,""]
[null,null,"10.",null,null,null,null,null,null,"",null,null,null,null,null,null,"20.",null,null,null,null,null,null,""]
[null,null,null,null,null,null,null,null,null,null,null,null,null,null,null,null,null,null,null,null,null,null,null,null,null,null,null,null,null,null,null,null,null,null,null,null,null,"A",null,"A"]
[null,null,"En caso de tener algún comentario u observación al dato registrado en la respuesta de la presente pregunta, o de los datos que derivan de la misma, favor de anotarlo en el siguiente espacio. De lo contrario, déjelo en blanco."]
[]
[]
[]
[]
[]
[]
[]
["2.8.-","Indique si los siguientes elementos de la función registral fueron aplicados en las oficinas en las cabeceras regionales y/o en las oficinas en las cabeceras de distritos judiciales durante el año 2022."]
[null,null,"Si al menos una oficina aplicó el elemento, responda afirmativamente."]
[null,null,"Si responde \"1. Sí\" en el numeral 8, anote el otro elemento en el recuadro que se encuentra al final de la tabla."]
[]
[null,null,"Elemento",null,null,null,null,null,null,null,null,null,null,null,null,null,null,null,null,null,"¿Se aplicó\nen oficinas en las cabeceras regionales?                (1.Sí / 2.No / 9.No se sabe)",null,null,null,null,"¿Se aplicó\nen oficinas en las cabeceras de distritos judiciales? (1.Sí / 2.No / 9.No se sabe)"]
[null,null,"1.","Trámites y servicios",null,null,null,null,null,null,null,null,null,null,null,null,null,null,null,null,null,null,null,null,null,null,null,null,null,null,null,null,{"$f":"IF(W135=1,\"\",\"X\")","v":"X"},{"$f":"IF(W135=1,IF(COUNTBLANK(U230:U237)>0,1,0),0)","v":0},{"$f":"IF(W135=1,IF(COUNTBLANK(U230:U237)>0,1,0),0)","v":0}]
[null,null,2,"Folio real físico ",null,null,null,null,null,null,null,null,null,null,null,null,null,null,null,null,null,null,null,null,null,null,null,null,null,null,null,null,{"$f":"IF(W136=1,\"\",\"X\")","v":"X"},{"$f":"IF(W136=1,IF(COUNTBLANK(Z230:Z237)>0,1,0),0)","v":0},{"$f":"IF(W136=1,IF(COUNTBLANK(Z230:Z237)>0,1,0),0)","v":0}]
[null,null,"3.","Folio real electrónico"]
[null,null,"4.","Sistema de gestión registral"]
[null,null,"5.","Servicios electrónicos"]
[null,null,"6.","Firma electrónica"]
[null,null,"7.","Medidas de seguridad para el resguardo del acervo documental"]
[null,null,"8.","Otro (especifique)"]
[]
[null,null,"Otro elemento:\n(especifique)",null,null,null,null,null,null,null,null,null,null,null,null,null,null,null,null,null,null,null,null,null,null,null,null,null,null,null,null,null,null,null,{"$f":"IF(OR(U237=1, Z237=1),COUNTBLANK(G239),0)","v":0}]
[]
[null,null,"En caso de tener algún comentario u observación al dato registrado en la respuesta de la presente pregunta, o de los datos que derivan de la misma, favor de anotarlo en el siguiente espacio. De lo contrario, déjelo en blanco."]
[]
[]
[]
[]
[]
[]
[null,null,null,null,null,null,null,null,null,null,null,null,null,null,null,null,null,null,null,null,null,null,null,null,null,null,null,null,null,null,null,null,null,null,{"$f":"IF(SUM(AI28,AI40,AI54,AI56,AI70,AI72,AI82,AI92,AI102,AI117,AI127,AI139,AI149,AH180,AH204,AI230,AI231,AI239)=0,0,1)","v":1}]
[null,"II.2 Recursos humanos y capacitación"]
[null,"Instrucciones generales para las preguntas de la subsección:"]
[null,null,"1.- Si la institución encargada de la actividad registral forma parte de una institución con otras actividades, como catastral, notarial, territorial, entre otras; registre únicamente los datos del titular de la institución encargada de la actividad registral."]
[null,null,"2.- Si el titular de la institución tiene menos de un año en el cargo, registre \"1\" (uno) en la columna \"Antigüedad en el servicio público\"."]
[null,null,"3.- Para la cantidad total de personal, considere al que únicamente realizó funciones registrales. Si llevó a cabo funciones de tipo catastral, notarial o territorial a la par de registral, no deben ser considerados."]
[null,null,"4.- Para las cantidades totales de personal capacitado por tema, contabilice solamente una vez a aquellos servidores públicos que tomaron más de un curso sobre el mismo tema. "]
[null,null,null,null,null,null,null,null,null,null,null,null,null,null,null,null,null,null,null,null,null,null,null,null,null,null,null,null,null,null,null,null,null,null,{"$f":"IF(C54<>\"\",IF(COUNTBLANK(D259)=1,1,0),0)","v":0}]
["2.9.-","Enliste los datos del titular de la institución registral durante el año 2022.",null,null,null,null,null,null,null,null,null,null,null,null,null,null,null,null,null,null,null,null,null,null,null,null,null,null,null,null,null,null,null,null,{"$f":"IF(D259<>\"\",IF(COUNTBLANK(K259)+COUNTBLANK(P259)+COUNTBLANK(S259)+COUNTBLANK(V259)+COUNTBLANK(Y259)+COUNTBLANK(AB259)>0,1,0 ),0)","v":0}]
[]
[null,null,"Nombre oficial de la institución registral",null,null,null,null,null,null,null,"Cargo del titular",null,null,null,null,"Sexo\n(ver catálogo)",null,null,"Edad \n(años)",null,null,"Nivel de escolaridad\n(ver catálogo)",null,null,"Antigüedad en el servicio público\n(años)",null,null,"Empleo anterior\n(ver catálogo)"]
[null,null,"1.",{"$f":"IF(UPPER(C54)=\"OTRO\",G56,IF(C54=\"\",\"\",C54))","v":""}]
[]
[null,null,"Catálogo de sexo",null,null,null,null,null,null,"Catálogo de nivel de escolaridad"]
[null,null,"1.","Hombre",null,null,null,null,null,"1.","Ninguno",null,null,null,null,null,"4.","Preparatoria",null,null,null,null,null,"7.","Maestría"]
[null,null,"2.","Mujer",null,null,null,null,null,"2.","Preescolar o primaria",null,null,null,null,null,"5.","Carrera técnica o carrera comercial",null,null,null,null,null,"8.","Doctorado"]
[null,null,null,null,null,null,null,null,null,"3.","Secundaria",null,null,null,null,null,"6.","Licenciatura",null,null,null,null,null,"9.","No se sabe"]
[]
[null,null,"Catálogo de empleo anterior"]
[null,null,"1.","Gobierno federal",null,null,null,null,null,"5.","Empleado del sector privado",null,null,null,null,null,"9.","Sector social\n(Organizaciones de la sociedad civil)",null,null,null,null,null,"99.","No se sabe"]
[null,null,"2.","Gobierno estatal",null,null,null,null,null,"6.","Cargo de elección popular",null,null,null,null,null,"10.","Academia\n(Profesor/investigador de tiempo completo)"]
[null,null,"3.","Gobierno municipal",null,null,null,null,null,"7.","Representación sindical",null,null,null,null,null,"11.","Es primer trabajo"]
[null,null,"4.","Negocio propio",null,null,null,null,null,"8.","Cargo en partido político",null,null,null,null,null,"12.","Otro"]
[]
[null,null,"En caso de tener algún comentario u observación al dato registrado en la respuesta de la presente pregunta, o de los datos que derivan de la misma, favor de anotarlo en el siguiente espacio. De lo contrario, déjelo en blanco."]
[]
[]
[]
[]
[]
[]
[]
["2.10.-","Indique la experiencia técnica del titular de la institución registral en la función notarial.",null,null,null,null,null,null,null,null,null,null,null,null,null,null,null,null,null,null,null,null,null,null,null,null,null,null,null,null,null,null,null,null,{"$f":"IF(M283=1,IF(COUNTBLANK(S283)+COUNTBLANK(Y283)>0,1,0),0)+COUNTBLANK(M283)","v":1}]
[]
[null,null,null,null,null,null,null,null,null,null,null,null,"¿Ejerció la función notarial?\n(1.Sí / 2.No / \n9.No se sabe)",null,null,null,null,null,"¿Cuánto tiempo?\n(Años)",null,null,null,null,null,"¿En qué entidad federativa?"]
[null,null,"1.","Titular de la institución registral"]
[]
[null,null,"En caso de tener algún comentario u observación al dato registrado en la respuesta de la presente pregunta, o de los datos que derivan de la misma, favor de anotarlo en el siguiente espacio. De lo contrario, déjelo en blanco."]
[]
[]
[]
[]
[]
[]
[]
["2.11.-","Indique la experiencia técnica del titular de la institución registral en las siguientes actividades registrales.",null,null,null,null,null,null,null,null,null,null,null,null,null,null,null,null,null,null,null,null,null,null,null,null,null,null,null,null,null,null,null,null,{"$f":"IF(K300=1,IF(COUNTBLANK(P300:AD300)=15,1,0),0)+COUNTBLANK(K300)","v":1}]
[null,null,"Puede seleccionar con \"X\" más de un tipo de actividad."]
[null,null,"Si selecciona el numeral 14, anote la otra actividad en el recuadro que está al final de la tabla."]
[null,null,"Si selecciona el numeral 99, no marque otra columna."]
[]
[null,null,null,null,null,null,null,null,null,null,"¿Tuvo experiencia técnica?\n(1.Sí / 2.No / \n9.No se sabe)",null,null,null,null,"Actividad\n(ver catálogo)"]
[null,null,null,null,null,null,null,null,null,null,null,null,null,null,null,1,2,3,4,5,6,7,8,9,10,11,12,13,14,99]
[null,null,"1.","Titular de la institución registral"]
[]
[null,null,"Otra actividad:\n(especifique)",null,null,null,null,null,null,null,null,null,null,null,null,null,null,null,null,null,null,null,null,null,null,null,null,null,null,null,null,null,null,null,{"$f":"IF(UPPER(AC300=\"X\"),COUNTBLANK(G302),0)","v":0}]
[]
[null,null,"Catálogo de tipo de actividad"]
[null,null,"1.","Revisor",null,null,null,null,null,null,null,"6.","Registrador",null,null,null,null,null,null,null,"11.","Consultor eventual por honorarios"]
[null,null,"2.","Inscribidor",null,null,null,null,null,null,null,"7.","Registrador suplente y/o auxiliar",null,null,null,null,null,null,null,"12.","Regidor de libros"]
[null,null,"3.","Validador",null,null,null,null,null,null,null,"8.","Oficial registrador",null,null,null,null,null,null,null,"13.","Capturista"]
[null,null,"4.","Calificador",null,null,null,null,null,null,null,"9.","Delegado",null,null,null,null,null,null,null,"14.","Otra"]
[null,null,"5.","Certificador",null,null,null,null,null,null,null,"10.","Notificador habilitado",null,null,null,null,null,null,null,"99.","No se sabe"]
[]
[null,null,"En caso de tener algún comentario u observación al dato registrado en la respuesta de la presente pregunta, o de los datos que derivan de la misma, favor de anotarlo en el siguiente espacio. De lo contrario, déjelo en blanco."]
[]
[]
[]
[]
[]
[]
[]
["2.12.-","Anote la cantidad total de personal adscrito a la institución registral de la entidad federativa al cierre del año 2022."]
[]
[null,null,null,null,null,null,"1. Total de personal (suma de 1.1 Hombres + 1.2 Mujeres)",null,null,null,null,null,null,null,null,null,null,null,null,null,null,null,null,null,null,null,null,null,null,null,null,null,"X",null,{"$f":"IF(COUNTBLANK(C321)+COUNTBLANK(E323)+COUNTBLANK(E325)>0,1,0)","v":1}]
[]
[null,null,null,null,null,null,null,null,"1.1 Hombres"]
[]
[null,null,null,null,null,null,null,null,"1.2 Mujeres"]
[]
[null,null,"En caso de tener algún comentario u observación al dato registrado en la respuesta de la presente pregunta, o de los datos que derivan de la misma, favor de anotarlo en el siguiente espacio. De lo contrario, déjelo en blanco."]
[]
[]
[]
[]
[]
[]
[]
["2.13.-","Anote, conforme a la siguiente tabla, la cantidad de personal según régimen de contratación y sexo al cierre del año 2022.",null,null,null,null,null,null,null,null,null,null,null,null,null,null,null,null,null,null,null,null,null,null,null,null,null,null,null,null,null,null,null,null,{"$f":"IF(AND(UPPER(E323)=\"NS\",UPPER(E325)=\"NS\"),0,IF(AND(C321<>\"\", E323<>\"\", E325<>\"\"),IF(COUNTBLANK(P341:P347)+COUNTBLANK(U341:U347)+COUNTBLANK(Z341:Z347)>0,1,0),0))","v":0}]
[null,null,"Las sumas de las cantidades anotadas por régimen de contratación y por sexo deben ser iguales al total de personal registrado como respuesta de la pregunta 2.12."]
[null,null,"Si usa el numeral 7, anote el otro régimen de contratación en el recuadro que se encuentra al final de la tabla."]
[]
[null,null,"Régimen de contratación",null,null,null,null,null,null,null,null,null,null,null,null,"Total",null,null,null,null,"Personal adscrito a la institución registral, según sexo"]
[null,null,null,null,null,null,null,null,null,null,null,null,null,null,null,null,null,null,null,null,"Hombres",null,null,null,null,"Mujeres"]
[null,null,"1.","Confianza"]
[null,null,"2.","Base o sindicalizado"]
[null,null,"3.","Eventual"]
[null,null,"4.","Honorarios"]
[null,null,"5.","Prestadores de servicio social"]
[null,null,"6.","Personal comisionado"]
[null,null,"7.","Otro (especifique)"]
[null,null,null,null,null,null,null,null,null,null,null,null,null,null,"S",{"$f":"IF(COUNTBLANK(P341:P347)=7,\"\",IF(AND(SUM(P341:T347)=0,COUNTIF(P341:T347,\"NS\")>0),\"NS\",SUM(P341:T347)))","v":""},null,null,null,null,{"$f":"IF(COUNTBLANK(U341:U347)=7,\"\",IF(AND(SUM(U341:Y347)=0,COUNTIF(U341:Y347,\"NS\")>0),\"NS\",SUM(U341:Y347)))","v":""},null,null,null,null,{"$f":"IF(COUNTBLANK(Z341:Z347)=7,\"\",IF(AND(SUM(Z341:AD347)=0,COUNTIF(Z341:AD347,\"NS\")>0),\"NS\",SUM(Z341:AD347)))","v":""}]
[]
[null,null,"Otro régimen de contratación:\n(especifique)",null,null,null,null,null,null,null,null,null,null,null,null,null,null,null,null,null,null,null,null,null,null,null,null,null,null,null,null,null,null,null,{"$f":"IF(AND(UPPER(E323)=\"NS\",UPPER(E325)=\"NS\"),0,IF(AND(P347>0,UPPER(P347)<>\"NS\"),COUNTBLANK(G350),0))","v":0}]
[]
[null,null,"En caso de tener algún comentario u observación al dato registrado en la respuesta de la presente pregunta, o de los datos que derivan de la misma, favor de anotarlo en el siguiente espacio. De lo contrario, déjelo en blanco."]
[]
[]
[]
[]
[]
[]
[]
["2.14.-","Anote, conforme a la siguiente tabla, la cantidad de personal según nivel de puesto y sexo al cierre del año 2022.",null,null,null,null,null,null,null,null,null,null,null,null,null,null,null,null,null,null,null,null,null,null,null,null,null,null,null,null,null,null,null,null,{"$f":"IF(AND(UPPER(E323)=\"NS\",UPPER(E325)=\"NS\"),0,IF(AND(C321<>\"\", E323<>\"\", E325<>\"\"),IF(COUNTBLANK(P369:P372)+COUNTBLANK(U369:U372)+COUNTBLANK(Z369:Z372)>0,1,0),0))","v":0}]
[null,null,"Para la opción \"1. Directivo\", se debe considerar al titular de la institución registral, así como a los directores de área u homólogos."]
[null,null,"Para la opción \"2. Mando medio\", se debe considerar a los subdirectores u homólogos, así como a los jefes de unidades departamentales u homólogos."]
[null,null,"Para la opción \"3. Operativo\", se debe considerar a los revisores, inscribidores, validadores, calificadores, certificadores, registradores, registradores suplentes y/o auxiliares, oficiales registradores, delegados, notificadores habilitados, consultores eventuales por honorarios, entre otros."]
[null,null,"Las sumas de las cantidades anotadas por nivel de puesto y por sexo deben ser iguales al total de personal registrado como respuesta de la pregunta 2.12."]
[null,null,"Si usa el numeral 4, anote el otro nivel de puesto en el recuadro que se encuentra al final de la tabla."]
[]
[null,null,"Nivel de puesto ",null,null,null,null,null,null,null,null,null,null,null,null,"Total",null,null,null,null,"Personal adscrito a la institución registral, según sexo"]
[null,null,null,null,null,null,null,null,null,null,null,null,null,null,null,null,null,null,null,null,"Hombres",null,null,null,null,"Mujeres"]
[null,null,"1.","Directivo"]
[null,null,"2.","Mando medio"]
[null,null,"3.","Operativo"]
[null,null,"4.","Otro (especifique)"]
[null,null,null,null,null,null,null,null,null,null,null,null,null,null,"S",{"$f":"IF(COUNTBLANK(P369:P372)=4,\"\",IF(AND(SUM(P369:T372)=0,COUNTIF(P369:T372,\"NS\")>0),\"NS\",SUM(P369:T372)))","v":""},null,null,null,null,{"$f":"IF(COUNTBLANK(U369:U372)=4,\"\",IF(AND(SUM(U369:Y372)=0,COUNTIF(U369:Y372,\"NS\")>0),\"NS\",SUM(U369:Y372)))","v":""},null,null,null,null,{"$f":"IF(COUNTBLANK(Z369:Z372)=4,\"\",IF(AND(SUM(Z369:AD372)=0,COUNTIF(Z369:AD372,\"NS\")>0),\"NS\",SUM(Z369:AD372)))","v":""}]
[]
[null,null,"Otro nivel de puesto:\n(especifique)",null,null,null,null,null,null,null,null,null,null,null,null,null,null,null,null,null,null,null,null,null,null,null,null,null,null,null,null,null,null,null,{"$f":"IF(AND(UPPER(E323)=\"NS\",UPPER(E325)=\"NS\"),0,IF(AND(P372>0,UPPER(P372)<>\"NS\"),COUNTBLANK(G375),0))","v":0}]
[]
[null,null,"En caso de tener algún comentario u observación al dato registrado en la respuesta de la presente pregunta, o de los datos que derivan de la misma, favor de anotarlo en el siguiente espacio. De lo contrario, déjelo en blanco."]
[]
[]
[]
[]
[]
[]
[]
["2.15.-","Anote, conforme a la siguiente tabla, la cantidad de personal según nivel de escolaridad y sexo al cierre del año 2022.",null,null,null,null,null,null,null,null,null,null,null,null,null,null,null,null,null,null,null,null,null,null,null,null,null,null,null,null,null,null,null,null,{"$f":"IF(AND(UPPER(E323)=\"NS\",UPPER(E325)=\"NS\"),0,IF(AND(C321<>\"\", E323<>\"\", E325<>\"\"),IF(COUNTBLANK(P390:P397)+COUNTBLANK(U390:U397)+COUNTBLANK(Z390:Z397)>0,1,0),0))","v":0}]
[null,null,"Las sumas de las cantidades anotadas por nivel de escolaridad y por sexo deben ser iguales al total de personal registrado como respuesta de la pregunta 2.12."]
[]
[null,null,"Nivel de escolaridad",null,null,null,null,null,null,null,null,null,null,null,null,"Total",null,null,null,null,"Personal adscrito a la institución registral, según sexo"]
[null,null,null,null,null,null,null,null,null,null,null,null,null,null,null,null,null,null,null,null,"Hombres",null,null,null,null,"Mujeres"]
[null,null,"1.","Ninguno"]
[null,null,"2.","Preescolar o primaria"]
[null,null,"3.","Secundaria"]
[null,null,"4.","Preparatoria"]
[null,null,"5.","Carrera técnica o comercial"]
[null,null,"6.","Licenciatura"]
[null,null,"7.","Maestría"]
[null,null,"8.","Doctorado"]
[null,null,null,null,null,null,null,null,null,null,null,null,null,null,"S",{"$f":"IF(COUNTBLANK(P390:P397)=8,\"\",IF(AND(SUM(P390:T397)=0,COUNTIF(P390:T397,\"NS\")>0),\"NS\",SUM(P390:T397)))","v":""},null,null,null,null,{"$f":"IF(COUNTBLANK(U390:U397)=8,\"\",IF(AND(SUM(U390:Y397)=0,COUNTIF(U390:Y397,\"NS\")>0),\"NS\",SUM(U390:Y397)))","v":""},null,null,null,null,{"$f":"IF(COUNTBLANK(Z390:Z397)=8,\"\",IF(AND(SUM(Z390:AD397)=0,COUNTIF(Z390:AD397,\"NS\")>0),\"NS\",SUM(Z390:AD397)))","v":""}]
[]
[null,null,"En caso de tener algún comentario u observación al dato registrado en la respuesta de la presente pregunta, o de los datos que derivan de la misma, favor de anotarlo en el siguiente espacio. De lo contrario, déjelo en blanco."]
[]
[]
[]
[]
[]
[]
[]
["2.16.-","Anote, conforme a la siguiente tabla, la cantidad de personal según rango de edad y sexo al cierre del año 2022.",null,null,null,null,null,null,null,null,null,null,null,null,null,null,null,null,null,null,null,null,null,null,null,null,null,null,null,null,null,null,null,null,{"$f":"IF(AND(UPPER(E323)=\"NS\",UPPER(E325)=\"NS\"),0,IF(AND(C321<>\"\", E323<>\"\", E325<>\"\"),IF(COUNTBLANK(P414:P421)+COUNTBLANK(U413:U421)+COUNTBLANK(Z413:Z421)>0,1,0),0))","v":0}]
[null,null,"Las sumas de las cantidades anotadas por rango de edad y por sexo deben ser iguales al total de personal registrado como respuesta de la pregunta 2.12."]
[]
[null,null,"Rango de edad",null,null,null,null,null,null,null,null,null,null,null,null,"Total",null,null,null,null,"Personal adscrito a la institución registral, según sexo"]
[null,null,null,null,null,null,null,null,null,null,null,null,null,null,null,null,null,null,null,null,"Hombres",null,null,null,null,"Mujeres"]
[null,null,"1.","18 a 24 años"]
[null,null,"2.","25 a 29 años"]
[null,null,"3.","30 a 34 años"]
[null,null,"4.","35 a 39 años"]
[null,null,"5.","40 a 44 años"]
[null,null,"6.","45 a 49 años"]
[null,null,"7.","50 a 54 años"]
[null,null,"8.","55 a 59 años"]
[null,null,"9.","60 años o más"]
[null,null,null,null,null,null,null,null,null,null,null,null,null,null,"S",{"$f":"IF(COUNTBLANK(P413:P421)=9,\"\",IF(AND(SUM(P413:T421)=0,COUNTIF(P413:T421,\"NS\")>0),\"NS\",SUM(P413:T421)))","v":""},null,null,null,null,{"$f":"IF(COUNTBLANK(U413:U421)=9,\"\",IF(AND(SUM(U413:Y421)=0,COUNTIF(U413:Y421,\"NS\")>0),\"NS\",SUM(U413:Y421)))","v":""},null,null,null,null,{"$f":"IF(COUNTBLANK(Z413:Z421)=9,\"\",IF(AND(SUM(Z413:AD421)=0,COUNTIF(Z413:AD421,\"NS\")>0),\"NS\",SUM(Z413:AD421)))","v":""}]
[]
[null,null,"En caso de tener algún comentario u observación al dato registrado en la respuesta de la presente pregunta, o de los datos que derivan de la misma, favor de anotarlo en el siguiente espacio. De lo contrario, déjelo en blanco."]
[]
[]
[]
[]
[]
[]
[]
["2.17.-","Indique si en la institución registral de la entidad federativa existieron las siguientes áreas y anote el personal adscrito en cada una al cierre del año 2022."]
[null,null,"Las sumas de las cantidades anotadas por área y por sexo deben ser iguales al total de personal registrado como respuesta de la pregunta 2.12."]
[null,null,"Si existió personal que atendió, colaboró o estuvo asignado a más de un área, contabilícelo solo en la que desarrolló mayor actividad."]
[null,null,"La suma de las cantidades anotadas por área y por sexo se realizará contabilizando al personal registrado en las opciones 1 a 14, sin contar al personal registrado en las opciones 5.1 a 5.4, 7.1 a 7.2 y 8.1 a 8.3, ya que estos corresponden al desglose de las opciones 5, 7 y 8, respectivamente."]
[null,null,"La suma de las cantidades anotadas en las opciones 5.1 a 5.4 debe coincidir con las cantidades anotadas en la opción 5. De igual manera, la suma de las cantidades anotadas en las opciones 7.1 a 7.2 debe coincidir con las cantidades anotadas en la opción 7. Por último, la suma de las cantidades anotadas en las opciones 8.1 a 8.3 debe coincidir con las cantidades anotadas en la opción 8."]
[null,null,"El numeral \"11. Cajas\" debe de responderse con \"1. Sí \" cuando dicha área pertenezca a la institución registral. Si pertenece a Secretaría de Finanzas u otra institución, responda \"2. No\"."]
[null,null,"Si responde \"1.Sí \" en el numeral 14, anote la otra área en el recuadro que se encuentra al final de la tabla."]
[]
[null,null,"Área",null,null,null,null,null,null,null,null,null,null,"¿Existió el área?\n(1.Sí / 2.No / 9.No se sabe)",null,null,null,null,"Total ",null,null,null,"Personal adscrito a la institución registral, según sexo",null,null,null,null,null,null,null,null,null,null,null,{"$f":"IF(AND(UPPER(E323)=\"NS\",UPPER(E325)=\"NS\"),0,IF(AND(C321<>\"\", E323<>\"\", E325<>\"\"),IF(AND(N442=1,OR(S442=\"\",W442=\"\",AA442=\"\")),1,0)+IF(AND(N443=1,OR(S443=\"\",W443=\"\",AA443=\"\")),1,0)+IF(AND(N444=1,OR(S444=\"\",W444=\"\",AA444=\"\")),1,0)+IF(AND(N445=1,OR(S445=\"\",W445=\"\",AA445=\"\")),1,0)+IF(AND(N446=1,OR(S446=\"\",W446=\"\",AA446=\"\",N447=\"\",N448=\"\",N449=\"\",N450=\"\")),1,0)+IF(AND(N446=1,N447=1,OR(S447=\"\",W447=\"\",AA447=\"\")),1,0)+IF(AND(N446=1,N448=1,OR(S448=\"\",W448=\"\",AA448=\"\")),1,0)+IF(AND(N446=1,N449=1,OR(S449=\"\",W449=\"\",AA449=\"\")),1,0)+IF(AND(N446=1,N450=1,OR(S450=\"\",W450=\"\",AA450=\"\")),1,0)+IF(AND(N451=1,OR(S451=\"\",W451=\"\",AA451=\"\")),1,0)+IF(AND(N452=1,OR(S452=\"\",W452=\"\",AA452=\"\",N453=\"\",N454=\"\")),1,0)+IF(AND(N452=1,N452=1,OR(S453=\"\",W453=\"\",AA453=\"\")),1,0)+IF(AND(N452=1,N454=1,OR(S454=\"\",W454=\"\",AA454=\"\")),1,0)+IF(AND(N455=1,OR(S455=\"\",W455=\"\",AA455=\"\",N456=\"\",N457=\"\",N458=\"\")),1,0)+IF(AND(N455=1,N456=1,OR(S456=\"\",W456=\"\",AA456=\"\")),1,0)+IF(AND(N455=1,N457=1,OR(S457=\"\",W457=\"\",AA457=\"\")),1,0)+IF(AND(N455=1,N458=1,OR(S458=\"\",W458=\"\",AA458=\"\")),1,0)+IF(AND(N459=1,OR(S459=\"\",W459=\"\",AA459=\"\")),1,0)+IF(AND(N460=1,OR(S460=\"\",W460=\"\",AA460=\"\")),1,0)+IF(AND(N461=1,OR(S461=\"\",W461=\"\",AA461=\"\")),1,0)+IF(AND(N462=1,OR(S462=\"\",W462=\"\",AA462=\"\")),1,0)+IF(AND(N463=1,OR(S463=\"\",W463=\"\",AA463=\"\")),1,0)+IF(AND(N464=1,OR(S464=\"\",W464=\"\",AA464=\"\")),1,0)+COUNTBLANK(N442)+COUNTBLANK(N443)+COUNTBLANK(N444)+COUNTBLANK(N445)+COUNTBLANK(N446)+COUNTBLANK(N451)+COUNTBLANK(N452)+COUNTBLANK(N455)+COUNTBLANK(N459)+COUNTBLANK(N460)+COUNTBLANK(N461)+COUNTBLANK(N462)+COUNTBLANK(N463)+COUNTBLANK(N464),0))","v":0}]
[null,null,null,null,null,null,null,null,null,null,null,null,null,null,null,null,null,null,null,null,null,null,"Hombres",null,null,null,"Mujeres"]
[null,null,"1.","Dirección"]
[null,null,"2.","Jurídico"]
[null,null,"3.","Informática "]
[null,null,"4.","Administrativo"]
[null,null,"5.","Atención al público/Información",null,null,null,null,null,null,null,null,null,null,null,null,null,null,null,null,null,null,null,null,null,null,null,null,null,null,null,null,{"$f":"IF(N446=1,\"\",\"X\")","v":"X"}]
[null,null,"5.1",null,"Ventanilla de trámites al público en general"]
[null,null,"5.2",null,"Ventanilla de trámites para gestores y notarías"]
[null,null,"5.3",null,"Ventanilla de trámites para atención especial"]
[null,null,"5.4",null,"Área de entrega de documentos"]
[null,null,"6.","Consulta de información registral"]
[null,null,"7.","Conservación del acervo ",null,null,null,null,null,null,null,null,null,null,null,null,null,null,null,null,null,null,null,null,null,null,null,null,null,null,null,null,{"$f":"IF(N452=1,\"\",\"X\")","v":"X"}]
[null,null,"7.1",null,"Archivo"]
[null,null,"7.2",null,"Digitalización"]
[null,null,"8.","Procesos registrales",null,null,null,null,null,null,null,null,null,null,null,null,null,null,null,null,null,null,null,null,null,null,null,null,null,null,null,null,{"$f":"IF(N455=1,\"\",\"X\")","v":"X"}]
[null,null,"8.1",null,"Registro/inscripción"]
[null,null,"8.2",null,"Calificación/validación"]
[null,null,"8.3",null,"Certificación"]
[null,null,"9.","Mercantil"]
[null,null,"10.","Fiscalización"]
[null,null,"11.","Cajas"]
[null,null,"12.","Auxiliar"]
[null,null,"13.","Modernización"]
[null,null,"14.","Otra (especifique)"]
[null,null,null,null,null,null,null,null,null,null,null,null,null,null,null,null,null,"S",{"$f":"IF(COUNTBLANK(S442:S446)+COUNTBLANK(S451:S452)+COUNTBLANK(S459:S464)+COUNTBLANK(S455)=14,\"\",IF(AND(SUM(S442:V446,S451:V452,S455,S459:V464)=0,COUNTIF(S442:V446,\"NS\")+COUNTIF(S451:V452,\"NS\")+COUNTIF(S455,\"NS\")+COUNTIF(S459:V464,\"NS\")>0),\"NS\",SUM(S442:V446,S451:V452,S455,S459:V464)))","v":""},null,null,null,{"$f":"IF(COUNTBLANK(W442:W446)+COUNTBLANK(W451:W452)+COUNTBLANK(W459:W464)+COUNTBLANK(W455)=14,\"\",IF(AND(SUM(W442:Z446,W451:Z452,W455,W459:Z464)=0,COUNTIF(W442:Z446,\"NS\")+COUNTIF(W451:Z452,\"NS\")+COUNTIF(W455,\"NS\")+COUNTIF(W459:Z464,\"NS\")>0),\"NS\",SUM(W442:Z446,W451:Z452,W455,W459:Z464)))","v":""},null,null,null,{"$f":"IF(COUNTBLANK(AA442:AA446)+COUNTBLANK(AA451:AA452)+COUNTBLANK(AA459:AA464)+COUNTBLANK(AA455)=14,\"\",IF(AND(SUM(AA442:AD446,AA451:AD452,AA455,AA459:AD464)=0,COUNTIF(AA442:AD446,\"NS\")+COUNTIF(AA451:AD452,\"NS\")+COUNTIF(AA455,\"NS\")+COUNTIF(AA459:AD464,\"NS\")>0),\"NS\",SUM(AA442:AD446,AA451:AD452,AA455,AA459:AD464)))","v":""}]
[]
[null,null,"Otra área:\n(especifique)",null,null,null,null,null,null,null,null,null,null,null,null,null,null,null,null,null,null,null,null,null,null,null,null,null,null,null,null,null,null,null,{"$f":"IF(N464=1,COUNTBLANK(G467),0)","v":0}]
[]
[null,null,"En caso de tener algún comentario u observación al dato registrado en la respuesta de la presente pregunta, o de los datos que derivan de la misma, favor de anotarlo en el siguiente espacio. De lo contrario, déjelo en blanco."]
[]
[]
[]
[]
[]
[]
[]
["2.18.-","Indique si el personal de la institución registral de la entidad federativa fue capacitado en temas registrales durante el año 2022.",null,null,null,null,null,null,null,null,null,null,null,null,null,null,null,null,null,null,null,null,null,null,null,null,null,null,null,null,null,null,null,null,{"$f":"IF(COUNTBLANK(C480)+COUNTBLANK(I480)+COUNTBLANK(T480)=3,1,0)","v":1}]
[null,null,"Seleccione con \"X\" un solo código."]
[]
[null,null,null,"1. Sí",null,null,null,null,null,"2. No (pase a la pregunta 2.21)",null,null,null,null,null,null,null,null,null,null,"9. No se sabe (pase a la pregunta 2.21)"]
[]
[null,null,"En caso de tener algún comentario u observación al dato registrado en la respuesta de la presente pregunta, o de los datos que derivan de la misma, favor de anotarlo en el siguiente espacio. De lo contrario, déjelo en blanco."]
[]
[]
[]
[]
[]
[]
[]
["2.19.-","Indique si la formación brindada durante el año 2022 fue parte de un programa anual de capacitación de la institución registral de la entidad federativa.",null,null,null,null,null,null,null,null,null,null,null,null,null,null,null,null,null,null,null,null,null,null,null,null,null,null,null,null,null,null,null,null,{"$f":"IF(UPPER(C480)=\"X\",IF(COUNTBLANK(C493)+COUNTBLANK(I493)+COUNTBLANK(T493)=3,1,0),0)","v":0}]
[null,null,"Seleccione con \"X\" un solo código."]
[]
[null,null,null,"1. Sí",null,null,null,null,null,"2. No",null,null,null,null,null,null,null,null,null,null,"9. No se sabe"]
[]
[null,null,"En caso de tener algún comentario u observación al dato registrado en la respuesta de la presente pregunta, o de los datos que derivan de la misma, favor de anotarlo en el siguiente espacio. De lo contrario, déjelo en blanco."]
[]
[]
[]
[]
[]
[]
[]
["2.20.-","Indique si se brindó capacitación en los siguientes temas y anote tanto la cantidad de cursos impartidos como el número de servidores públicos capacitados durante el año 2022.",null,null,null,null,null,null,null,null,null,null,null,null,null,null,null,null,null,null,null,null,null,null,null,null,null,null,null,null,null,null,null,null,{"$f":"IF(UPPER(C480)=\"X\",(IF(AND(P508=1,OR(U508=\"\",Z508=\"\")),1,0)+IF(AND(P509=1,OR(U509=\"\",Z509=\"\")),1,0)+IF(AND(P510=1,OR(U510=\"\",Z510=\"\")),1,0)+IF(AND(P511=1,OR(U511=\"\",Z511=\"\")),1,0)+IF(AND(P512=1,OR(U512=\"\",Z512=\"\")),1,0)+IF(AND(P513=1,OR(U513=\"\",Z513=\"\")),1,0)+IF(AND(P514=1,OR(U514=\"\",Z514=\"\")),1,0)+IF(AND(P515=1,OR(U515=\"\",Z515=\"\")),1,0)+IF(AND(P516=1,OR(U516=\"\",Z516=\"\")),1,0)+IF(AND(P517=1,OR(U517=\"\",Z517=\"\")),1,0)+IF(AND(P518=1,OR(U518=\"\",Z518=\"\")),1,0)+IF(AND(P519=1,OR(U519=\"\",Z519=\"\")),1,0)+IF(AND(P520=1,OR(U520=\"\",Z520=\"\")),1,0)+IF(AND(P521=1,OR(U521=\"\",Z521=\"\")),1,0)+IF(AND(P522=1,OR(U522=\"\",Z522=\"\")),1,0)+IF(AND(P523=1,OR(U523=\"\",Z523=\"\")),1,0)+IF(AND(P524=1,OR(U524=\"\",Z524=\"\")),1,0)+IF(AND(P525=1,OR(U525=\"\",Z525=\"\")),1,0)+IF(AND(P526=1,OR(U526=\"\",Z526=\"\")),1,0)+IF(AND(P527=1,OR(U527=\"\",Z527=\"\")),1,0)+IF(AND(P528=1,OR(U528=\"\",Z528=\"\")),1,0)+IF(AND(P529=1,OR(U529=\"\",Z529=\"\")),1,0)+IF(AND(P530=1,OR(U530=\"\",Z530=\"\")),1,0)+IF(AND(P531=1,OR(U531=\"\",Z531=\"\")),1,0)+IF(AND(P532=1,OR(U532=\"\",Z532=\"\")),1,0)+IF(AND(P533=1,OR(U533=\"\",Z533=\"\")),1,0)+IF(AND(P534=1,OR(U534=\"\",Z534=\"\")),1,0)+IF(AND(P535=1,OR(U527=\"\",Z535=\"\")),1,0)+IF(AND(P536=1,OR(U536=\"\",Z536=\"\")),1,0)+IF(AND(P537=1,OR(U537=\"\",Z537=\"\")),1,0)+IF(AND(P538=1,OR(U538=\"\",Z538=\"\")),1,0)+IF(AND(P539=1,OR(U539=\"\",Z539=\"\")),1,0)+COUNTBLANK(P508:P539)),0)","v":0}]
[null,null,"Si responde \"1. Sí\" en el numeral 9, anote el otro tema de capacitación en el recuadro que se encuentra al final de la tabla. Añada únicamente otro tema que esté relacionado a la actividad registral."]
[null,null,"La cantidad de servidores públicos capacitados por tema deberá ser menor o igual al total de personal registrado en la pregunta 2.12."]
[]
[null,null,"Tema",null,null,null,null,null,null,null,null,null,null,null,null,"¿Se brindó capacitación?\n(1.Sí / 2.No / \n9.No se sabe)",null,null,null,null,"Cantidad de cursos\nimpartidos durante el año 2022",null,null,null,null,"Cantidad de\nservidores públicos\ncapacitados durante el año 2022"]
[null,null,"1. Marco jurídico",null,"1.1",null,"Legislación relacionada con la actividad registral"]
[null,null,null,null,"1.2",null,"Principios registrales"]
[null,null,null,null,"1.3",null,"Instrumentos susceptibles de ser inscritos"]
[null,null,null,null,"1.4",null,"Calificación registral"]
[null,null,null,null,"1.5",null,"Medios de impugnación"]
[null,null,null,null,"1.6",null,"Amparo enfocado en la función registral"]
[null,null,null,null,"1.7",null,"Alcances de las resoluciones judiciales"]
[null,null,null,null,"1.8",null,"Derechos humanos "]
[null,null,"2. Procesos\n registrales",null,"2.1",null,"Inscripción"]
[null,null,null,null,"2.2",null,"Conservación del acervo"]
[null,null,null,null,"2.3",null,"Medidas de seguridad para el resguardo del acervo documental "]
[null,null,null,null,"2.4",null,"Certificación"]
[null,null,null,null,"2.5",null,"Consulta"]
[null,null,null,null,"2.6",null,"Personas morales civiles y mercantiles"]
[null,null,null,null,"2.7",null,"Contratos civiles y mercantiles"]
[null,null,null,null,"2.8",null,"Fideicomisos"]
[null,null,null,null,"2.9",null,"Sucesiones judiciales y notariales"]
[null,null,null,null,"2.10",null,"Adjudicaciones judiciales"]
[null,null,null,null,"2.11",null,"Cancelación de gravámenes"]
[null,null,"3.",null,"Trámites registrales"]
[null,null,"4.",null,"Atención al público"]
[null,null,"5. Tecnologías \nde la información",null,"5.1",null,"Uso y manejo del sistema de gestión registral"]
[null,null,null,null,"5.2",null,"Vinculación entre el catastro estatal y la institución registral "]
[null,null,null,null,"5.3",null,"Firma electrónica"]
[null,null,null,null,"5.4",null,"Folio real electrónico"]
[null,null,"6. Gestión \nde\ncalidad",null,"6.1",null,"Normas ISO"]
[null,null,null,null,"6.2",null,"Gestión de riesgos"]
[null,null,null,null,"6.3",null,"Seguridad informática "]
[null,null,null,null,"6.4",null,"Auditorías"]
[null,null,"7.",null,"Participación y vinculación con otros sectores"]
[null,null,"8.",null,"Transparencia"]
[null,null,"9.",null,"Otro (especifique)"]
[]
[null,null,"Otro tema de capacitación:\n(especifique)",null,null,null,null,null,null,null,null,null,null,null,null,null,null,null,null,null,null,null,null,null,null,null,null,null,null,null,null,null,null,null,{"$f":"IF(P539=1,COUNTBLANK(G541),0)","v":0}]
[]
[null,null,"En caso de tener algún comentario u observación al dato registrado en la respuesta de la presente pregunta, o de los datos que derivan de la misma, favor de anotarlo en el siguiente espacio. De lo contrario, déjelo en blanco."]
[]
[]
[]
[]
[]
[]
[null,null,null,null,null,null,null,null,null,null,null,null,null,null,null,null,null,null,null,null,null,null,null,null,null,null,null,null,null,null,null,null,null,null,{"$f":"IF(SUM(AI255,AI256,AI280,AI293,AI302,AI321,AI335,AI350,AI360,AI375,AI385,AI408,AI440,AI467,AI477,AI490,AI503,AI541)=0,0,1)","v":1}]
[null,"II.3 Marco jurídico"]
[]
["2.21.-","Seleccione los ordenamientos jurídicos que durante el año 2022 regularon la actividad registral en la entidad federativa.",null,null,null,null,null,null,null,null,null,null,null,null,null,null,null,null,null,null,null,null,null,null,null,null,null,null,null,null,null,null,null,null,{"$f":"IF(COUNTBLANK(C558:C573)=16,1,0)","v":1}]
[null,null,"Puede seleccionar con \"X\" más de un código."]
[null,null,"Si marca el numeral 14, anote el otro ordenamiento jurídico en el recuadro que se encuentra al final de la lista."]
[null,null,"Si elige el numeral 15 o el 99, no marque otro código."]
[]
[null,null,null,"1. Ley de la institución registral u homóloga"]
[null,null,null,"2. Reglamento de la ley de la institución registral u homólogo"]
[null,null,null,"3. Reglamento interior de la institución registral u homólogo"]
[null,null,null,"4. Código de comercio"]
[null,null,null,"5. Código civil estatal"]
[null,null,null,"6. Código fiscal estatal"]
[null,null,null,"7. Ley general de sociedades mercantiles"]
[null,null,null,"8. Ley general de títulos y operaciones de crédito"]
[null,null,null,"9. Ley estatal de procedimiento administrativo"]
[null,null,null,"10. Ley estatal de ingresos"]
[null,null,null,"11. Ley estatal de hacienda"]
[null,null,null,"12. Ley de hacienda municipal"]
[null,null,null,"13. Acuerdos o criterios registrales de observancia obligatoria"]
[null,null,null,"14. Otro (especifique)"]
[null,null,null,"15. Ninguno"]
[null,null,null,"99. No se sabe"]
[]
[null,null,"Otro ordenamiento jurídico:\n(especifique)",null,null,null,null,null,null,null,null,null,null,null,null,null,null,null,null,null,null,null,null,null,null,null,null,null,null,null,null,null,null,null,{"$f":"IF(UPPER(C571=\"X\"),COUNTBLANK(G575),0)","v":0}]
[]
[null,null,"En caso de tener algún comentario u observación al dato registrado en la respuesta de la presente pregunta, o de los datos que derivan de la misma, favor de anotarlo en el siguiente espacio. De lo contrario, déjelo en blanco."]
[null,null,null,null,null,null,null,null,null,null,null,null,null,null,null,null,null,null,null,null,null,null,null,null,null,null,null,null,null,null,null,null,null,null,null,{"$f":"IF(AK578=1,COUNTBLANK(C578),0)","v":0},0]
[]
[]
[]
[]
[]
[]
["2.22.-","Seleccione los ordenamientos jurídicos que durante el año 2022 regularon la actividad registral de manera complementaria en la entidad federativa.",null,null,null,null,null,null,null,null,null,null,null,null,null,null,null,null,null,null,null,null,null,null,null,null,null,null,null,null,null,null,null,null,{"$f":"IF(COUNTBLANK(C590:C601)=12,1,0)","v":1}]
[null,null,"Puede seleccionar con \"X\" más de un código."]
[null,null,"Si marca el numeral 10, anote el otro ordenamiento jurídico en el recuadro que se encuentra al final de la lista."]
[null,null,"Si elige el numeral 11 o el 99, no marque otro código."]
[]
[null,null,null,"1. Ley orgánica de la administración pública estatal"]
[null,null,null,"2. Ley estatal de catastro u homóloga"]
[null,null,null,"3. Ley estatal del servicio profesional de carrera registral u homóloga"]
[null,null,null,"4. Ley estatal de firma electrónica"]
[null,null,null,"5. Ley o código estatal en materia de asentamientos humanos, ordenamiento territorial y desarrollo urbano"]
[null,null,null,"6. Ley estatal de responsabilidades de los servidores públicos u homóloga"]
[null,null,null,"7. Ley estatal del notariado u homóloga"]
[null,null,null,"8. Ley estatal de derechos"]
[null,null,null,"9. Código de procedimientos civiles estatal"]
[null,null,null,"10. Otro (especifique)"]
[null,null,null,"11. Ninguno"]
[null,null,null,"99. No se sabe"]
[]
[null,null,"Otro ordenamiento jurídico:\n(especifique)",null,null,null,null,null,null,null,null,null,null,null,null,null,null,null,null,null,null,null,null,null,null,null,null,null,null,null,null,null,null,null,{"$f":"IF(UPPER(C599=\"X\"),COUNTBLANK(G603),0)","v":0}]
[]
[null,null,"En caso de tener algún comentario u observación al dato registrado en la respuesta de la presente pregunta, o de los datos que derivan de la misma, favor de anotarlo en el siguiente espacio. De lo contrario, déjelo en blanco."]
[]
[]
[]
[]
[]
[]
[]
["2.23.-","Indique si las siguientes funciones se establecieron expresamente en los ordenamientos jurídicos que regularon la actividad registral durante el año 2022 en la entidad federativa.",null,null,null,null,null,null,null,null,null,null,null,null,null,null,null,null,null,null,null,null,null,null,null,null,null,null,null,null,null,null,null,null,{"$f":"(IF(COUNTBLANK(Z617:Z631)>0,1,0))","v":1}]
[null,null,"Si responde \"1. Sí\" en el numeral 15, anote la otra función en el recuadro que se encuentra al final de la tabla."]
[]
[null,null,"Funciones",null,null,null,null,null,null,null,null,null,null,null,null,null,null,null,null,null,null,null,null,null,null,"¿Se estableció en el ordenamiento jurídico?\n(1.Sí / 2.No / 9.No se sabe)"]
[null,null,"1.","Ejercer la fe pública registral."]
[null,null,"2.","Establecer los mecanismos para cumplir con los principios registrales."]
[null,null,"3.","Proporcionar de manera eficaz y eficiente los servicios y trámites registrales que solicite la ciudadanía."]
[null,null,"4.","Establecer los programas necesarios para evaluar la competencia del personal de la institución registral, certificarlo y asegurar que actualice en forma continua sus conocimientos sobre la normatividad general."]
[null,null,"5.","Establecer los indicadores de eficiencia y productividad de los registradores, funcionarios y empleados de la institución registral."]
[null,null,"6.","Establecer como obligatorio el servicio profesional de la carrera registral."]
[null,null,"7.","Diseñar e instrumentar modalidades de servicios registrales electrónicos y/o en ventanilla, que, garantizando la certeza jurídica y el rigor de las operaciones registrales, respondan a las necesidades específicas de los usuarios institucionales, de los notarios y de los particulares que participan en el mercado inmobiliario."]
[null,null,"8.","Determinar las tarifas aplicables a los servicios registrales conforme a una metodología previamente establecida, utilizando criterios de racionalidad y sustentabilidad financiera de la institución."]
[null,null,"9.","Mantener un sistema confiable y eficiente de registro de los costos de operación de la institución registral, que apoye la determinación de las tarifas de los servicios registrales. "]
[null,null,"10.","Instrumentar modalidades de pago de los servicios, con el propósito de facilitar a los particulares el registro de las operaciones inmobiliarias y, en consecuencia, favorecer la actualización de los derechos constituidos sobre la propiedad inmobiliaria."]
[null,null,"11.","Diseñar e instrumentar las modalidades de facturación de los servicios a los usuarios, que permitan agilizar el proceso registral, salvaguardando en todo caso los intereses de la institución registral."]
[null,null,"12.","Preservar y conservar, bajo su más estricta responsabilidad, el acervo documental y/o electrónico que contenga los instrumentos, documentos y avisos propios de la actividad registral."]
[null,null,"13.","Establecer convenios de coordinación y/o de intercambio de información a título gratuito u oneroso, con las instituciones estatales y/o federales que tengan a su cargo la administración de catastros o registros inmobiliarios especiales, así como información relevante sobre la propiedad inmobiliaria."]
[null,null,"14.","Establecer convenios de servicios electrónicos y/o en ventanilla, con los usuarios institucionales, los notarios y/o los particulares que participan en el mercado inmobiliario."]
[null,null,"15.","Otra (especifique)"]
[]
[null,null,"Otra función:\n(especifique)",null,null,null,null,null,null,null,null,null,null,null,null,null,null,null,null,null,null,null,null,null,null,null,null,null,null,null,null,null,null,null,{"$f":"IF(Z631=1,COUNTBLANK(G633),0)","v":0}]
[]
[null,null,"En caso de tener algún comentario u observación al dato registrado en la respuesta de la presente pregunta, o de los datos que derivan de la misma, favor de anotarlo en el siguiente espacio. De lo contrario, déjelo en blanco."]
[]
[]
[]
[]
[]
[]
[]
["2.24.-","Seleccione los principios registrales que se establecieron expresamente en los ordenamientos jurídicos que regularon la actividad registral durante el año 2022 en la entidad federativa.",null,null,null,null,null,null,null,null,null,null,null,null,null,null,null,null,null,null,null,null,null,null,null,null,null,null,null,null,null,null,null,null,{"$f":"IF(COUNTBLANK(C648:C671)=24,1,0)","v":1}]
[null,null,"Puede seleccionar con \"X\" más de un código."]
[null,null,"Si marca el numeral 22, anote el otro principio registral en el recuadro que se encuentra al final de la lista."]
[null,null,"Si elige el numeral 23 o el 99, no marque otro código."]
[]
[null,null,null,"1. Fe pública registral"]
[null,null,null,"2. Publicidad"]
[null,null,null,"3. Inscripción"]
[null,null,null,"4. Especialidad o determinación"]
[null,null,null,"5. Consentimiento"]
[null,null,null,"6. Tracto sucesivo"]
[null,null,null,"7. Rogación"]
[null,null,null,"8. Prioridad o prelación"]
[null,null,null,"9. Legalidad y calificación registral"]
[null,null,null,"10. Legitimación"]
[null,null,null,"11. Oponibilidad"]
[null,null,null,"12. Veracidad"]
[null,null,null,"13. Identidad"]
[null,null,null,"14. Ubicación geográfica"]
[null,null,null,"15. Desarrollo multifinalitario"]
[null,null,null,"16. Socialización"]
[null,null,null,"17. Tercero registral"]
[null,null,null,"18. Propiedad"]
[null,null,null,"19. Equivalencia funcional"]
[null,null,null,"20. Apariencia jurídica"]
[null,null,null,"21. Obligatoriedad"]
[null,null,null,"22. Otro (especifique)"]
[null,null,null,"23. Ninguno"]
[null,null,null,"99. No se sabe"]
[]
[null,null,"Otro principio registral:\n(especifique)",null,null,null,null,null,null,null,null,null,null,null,null,null,null,null,null,null,null,null,null,null,null,null,null,null,null,null,null,null,null,null,{"$f":"IF(UPPER(C669=\"X\"),COUNTBLANK(G673),0)","v":0}]
[]
[null,null,"En caso de tener algún comentario u observación al dato registrado en la respuesta de la presente pregunta, o de los datos que derivan de la misma, favor de anotarlo en el siguiente espacio. De lo contrario, déjelo en blanco."]
[null,null,null,null,null,null,null,null,null,null,null,null,null,null,null,null,null,null,null,null,null,null,null,null,null,null,null,null,null,null,null,null,null,null,null,{"$f":"IF(AK676=1,COUNTBLANK(C676),0)","v":0},0]
[]
[]
[]
[]
[]
[]
["2.25.-","Seleccione el efecto que tuvo la inscripción de los actos o contratos en la institución registral de la entidad federativa durante el año 2022.",null,null,null,null,null,null,null,null,null,null,null,null,null,null,null,null,null,null,null,null,null,null,null,null,null,null,null,null,null,null,null,null,{"$f":"IF(COUNTBLANK(C687:C689)=3,1,0)","v":1}]
[null,null,"Seleccione con \"X\" un solo código."]
[null,null,"Si marca el numeral 3, anote el otro efecto en el recuadro que se encuentra al final de la lista."]
[]
[null,null,null,"1. Declarativo"]
[null,null,null,"2. Declarativo y constitutivo"]
[null,null,null,"3. Otro (especifique)"]
[]
[null,null,"Otro efecto:\n(especifique)",null,null,null,null,null,null,null,null,null,null,null,null,null,null,null,null,null,null,null,null,null,null,null,null,null,null,null,null,null,null,null,{"$f":"IF(UPPER(C689=\"X\"),COUNTBLANK(G691),0)","v":0}]
[]
[null,null,"En caso de tener algún comentario u observación al dato registrado en la respuesta de la presente pregunta, o de los datos que derivan de la misma, favor de anotarlo en el siguiente espacio. De lo contrario, déjelo en blanco."]
[]
[]
[]
[]
[]
[]
[]
["2.26.-","Seleccione los documentos electrónicos que gozaron de validez legal plena durante el año 2022. ",null,null,null,null,null,null,null,null,null,null,null,null,null,null,null,null,null,null,null,null,null,null,null,null,null,null,null,null,null,null,null,null,{"$f":"IF(COUNTBLANK(C706:C718)=13,1,0)","v":1}]
[null,null,"Puede seleccionar con \"X\" más de un código."]
[null,null,"Si marca el numeral 11, anote el otro documento electrónico en el recuadro que se encuentra al final de la lista."]
[null,null,"Si elige el numeral 12 o el 99, no marque otro código."]
[]
[null,null,null,"1. Folio real electrónico "]
[null,null,null,"2. Imágenes digitales de documentos externos e internos"]
[null,null,null,"3. Firma electrónica"]
[null,null,null,"4. Sellos electrónicos"]
[null,null,null,"5. Formas precodificadas electrónicas"]
[null,null,null,"6. Constancias certificadas"]
[null,null,null,"7. Copias certificadas de inscripciones y anotaciones"]
[null,null,null,"8. Copias certificadas de los documentos externos en poder de la institución registral"]
[null,null,null,"9. Estrados electrónicos que publique la institución registral"]
[null,null,null,"10. Código Quick Response (QR)"]
[null,null,null,"11. Otro (especifique)"]
[null,null,null,"12. Ninguno"]
[null,null,null,"99. No se sabe"]
[]
[null,null,"Otro documento electrónico:\n(especifique)",null,null,null,null,null,null,null,null,null,null,null,null,null,null,null,null,null,null,null,null,null,null,null,null,null,null,null,null,null,null,null,{"$f":"IF(UPPER(C716=\"X\"),COUNTBLANK(G720),0)","v":0}]
[]
[null,null,"En caso de tener algún comentario u observación al dato registrado en la respuesta de la presente pregunta, o de los datos que derivan de la misma, favor de anotarlo en el siguiente espacio. De lo contrario, déjelo en blanco."]
[]
[]
[]
[]
[]
[]
[]
["2.27.-","Indique si en la institución registral de la entidad federativa existieron los siguientes manuales durante el año 2022 y si tuvieron validez jurídica.",null,null,null,null,null,null,null,null,null,null,null,null,null,null,null,null,null,null,null,null,null,null,null,null,null,null,null,null,null,null,null,null,{"$f":"IF(AND(S734=1,Y734=\"\"),1,0)+IF(AND(S735=1,Y735=\"\"),1,0)+IF(AND(S736=1,Y736=\"\"),1,0)+IF(AND(S737=1,Y737=\"\"),1,0)+ COUNTBLANK(S734:S737)","v":4}]
[null,null,"Si responde \"1. Sí\" en el numeral 4, anote el otro manual en el recuadro que está al final de la tabla."]
[]
[null,null,"Manual",null,null,null,null,null,null,null,null,null,null,null,null,null,null,null,"¿Existió?\n(1.Sí / 2.No / 9.No se sabe)",null,null,null,null,null,"¿Tuvo validez jurídica?\n(1.Sí / 2.No / 9.No se sabe)"]
[null,null,"1.","Manual de organización"]
[null,null,"2.","Manual de procedimientos"]
[null,null,"3.","Manual de sistema de gestión registral "]
[null,null,"4.","Otro (especifique)"]
[]
[null,null,"Otro manual:\n(especifique)",null,null,null,null,null,null,null,null,null,null,null,null,null,null,null,null,null,null,null,null,null,null,null,null,null,null,null,null,null,null,null,{"$f":"IF(S737=1,COUNTBLANK(G739),0)","v":0}]
[]
[null,null,"En caso de tener algún comentario u observación al dato registrado en la respuesta de la presente pregunta, o de los datos que derivan de la misma, favor de anotarlo en el siguiente espacio. De lo contrario, déjelo en blanco."]
[]
[]
[]
[]
[]
[]
[null,null,null,null,null,null,null,null,null,null,null,null,null,null,null,null,null,null,null,null,null,null,null,null,null,null,null,null,null,null,null,null,null,null,{"$f":"IF(SUM(AI553,AI575,AI585,AI603,AI613,AI633,AI643,AI673,AI683,AI691,AI701,AI720,AI730,AI739)=0,0,1)","v":1}]
[null,"II.4 Trámites y servicios registrales"]
[null,"Glosario de la subsección:"]
[null,null,"1.- Alerta inmobiliaria: se refiere al servicio mediante el cual, a través de dispositivos móviles, cuentas de correo electrónico u otros medios, se notifica de forma inmediata al titular registrado sobre cualquier tipo de consulta o movimiento que se lleve a cabo sobre su predio, a efecto de alertar sobre posibles modificaciones en su situación jurídica."]
[null,null,"2.- Certificado de gravamen o libertad de gravamen: se refiere a aquel en el que se hace constar la existencia de los gravámenes reales de una finca, tales como las hipotecas, prendas y servidumbres; o bien, aquel en el que se hace constar que una finca está libre de gravámenes reales."]
[null,null,"3.- Certificado de historia registral: se refiere a aquel que contiene la descripción de un inmueble, así como las anotaciones con que cuenta una inscripción y la relación de todos los antecedentes registrales, hasta la inscripción primordial."]
[null,null,"4.- Certificado de inscripción o no inscripción de predio: se refiere a aquel que certifica que un bien inmueble determinado se encuentra inscrito en la institución registral; o bien, aquel en el que se hace constar que un bien inmueble determinado no se encuentra inscrito en la institución registral."]
[null,null,"5.- Certificado de propiedad o no propiedad: se refiere a aquel en el que se describen todos los predios pertenecientes a una persona física o moral; o bien, aquel en el que se hace constar que en los archivos de la institución registral no existe registro de bienes inmuebles a favor de determinada persona física o moral."]
[null,null,"6.- Copias certificadas: se refiere a la expedición de copias de inscripciones o de documentos agregados al apéndice, debidamente autentificados."]
[]
["2.28.-","Indique si la institución registral de la entidad federativa brindó durante el año 2022 los siguientes trámites o servicios sobre bienes inmuebles y anote cuántos se realizaron.",null,null,null,null,null,null,null,null,null,null,null,null,null,null,null,null,null,null,null,null,null,null,null,null,null,null,null,null,null,null,null,null,{"$f":"IF(AND(Q762=1,OR(X762=\"\",Q763=\"\",Q764=\"\",Q765=\"\",Q766=\"\",Q767=\"\",Q768=\"\",Q769=\"\",Q770=\"\",Q771=\"\",Q772=\"\",Q773=\"\")),1,0)+IF(AND(Q774=1,OR(X774=\"\",Q775=\"\",Q776=\"\")),1,0)+IF(AND(Q777=1,X777=\"\"),1,0)+IF(AND(Q778=1,X778=\"\"),1,0)+IF(AND(Q779=1,OR(X779=\"\",Q780=\"\",Q781=\"\")),1,0)+IF(AND(Q782=1,OR(X782=\"\",Q783=\"\",Q784=\"\",Q785=\"\",Q786=\"\",Q787=\"\",Q788=\"\",Q789=\"\")),1,0)+IF(AND(Q790=1,X790=\"\"),1,0)+IF(AND(Q791=1,OR(X791=\"\",Q792=\"\",Q793=\"\",Q794=\"\",Q795=\"\",Q796=\"\",Q797=\"\",Q798=\"\")),1,0)+IF(AND(Q799=1,X799=\"\"),1,0)+IF(AND(Q800=1,X800=\"\"),1,0)+IF(AND(Q762=1,Q763=1,X763=\"\"),1,0)+IF(AND(Q762=1,Q764=1,X764=\"\"),1,0)+IF(AND(Q762=1,Q765=1,X765=\"\"),1,0)+IF(AND(Q762=1,Q766=1,X766=\"\"),1,0)+IF(AND(Q762=1,Q767=1,X767=\"\"),1,0)+IF(AND(Q762=1,Q768=1,X768=\"\"),1,0)+IF(AND(Q762=1,Q769=1,X769=\"\"),1,0)+IF(AND(Q762=1,Q770=1,X770=\"\"),1,0)+IF(AND(Q762=1,Q771=1,X771=\"\"),1,0)+IF(AND(Q762=1,Q772=1,X772=\"\"),1,0)+IF(AND(Q762=1,Q773=1,X773=\"\"),1,0)+IF(AND(Q774=1,Q775=1,X775=\"\"),1,0)+IF(AND(Q774=1,Q776=1,X776=\"\"),1,0)+IF(AND(Q782=1,Q783=1,X783=\"\"),1,0)+IF(AND(Q782=1,Q784=1,X784=\"\"),1,0)+IF(AND(Q782=1,Q785=1,X785=\"\"),1,0)+IF(AND(Q782=1,Q786=1,X786=\"\"),1,0)+IF(AND(Q782=1,Q787=1,X787=\"\"),1,0)+IF(AND(Q782=1,Q788=1,X788=\"\"),1,0)+IF(AND(Q782=1,Q789=1,X789=\"\"),1,0)+IF(AND(Q791=1,Q792=1,X792=\"\"),1,0)+IF(AND(Q791=1,Q793=1,X793=\"\"),1,0)+IF(AND(Q791=1,Q794=1,X794=\"\"),1,0)+IF(AND(Q791=1,Q795=1,X795=\"\"),1,0)+IF(AND(Q791=1,Q796=1,X796=\"\"),1,0)+IF(AND(Q791=1,Q797=1,X797=\"\"),1,0)+IF(AND(Q791=1,Q798=1,X798=\"\"),1,0)+COUNTBLANK(Q762)+COUNTBLANK(Q774)+COUNTBLANK(Q777)+COUNTBLANK(Q778)+COUNTBLANK(Q779)+COUNTBLANK(Q782)+COUNTBLANK(Q790)+COUNTBLANK(Q791)+COUNTBLANK(Q799)+COUNTBLANK(Q800)","v":10}]
[null,null,"Si responde \"1. Sí\" en el numeral 10, anote el otro trámite o servicio en el recuadro que está al final de la tabla."]
[]
[null,null,"Trámite o servicio",null,null,null,null,null,null,null,null,null,null,null,null,null,"¿Se brindó el trámite o servicio? \n(1.Sí / 2.No / \n9.No se sabe)",null,null,null,null,null,null,"Cantidad de trámites realizados"]
[null,null,"1.","Traslativo de dominio",null,null,null,null,null,null,null,null,null,null,null,null,null,null,null,null,null,null,null,null,null,null,null,null,null,null,null,null,{"$f":"IF(OR(Q762=2,Q762=9,Q762=\"\"),\"X\",\"\")","v":"X"}]
[null,null,"1.1",null,"Adjudicación"]
[null,null,"1.2",null,"Aplicación de bienes por disolución de la sociedad conyugal"]
[null,null,"1.3",null,"Aportación de bienes a una sociedad "]
[null,null,"1.4",null,"Cesión de bien inmueble"]
[null,null,"1.5",null,"Compraventa"]
[null,null,"1.6",null,"Dación en pago"]
[null,null,"1.7",null,"Donación "]
[null,null,"1.8",null,"Fideicomiso"]
[null,null,"1.9",null,"Permuta "]
[null,null,"1.10",null,"Prescripción positiva"]
[null,null,"1.11",null,"Título de propiedad"]
[null,null,"2.","Derechos reales",null,null,null,null,null,null,null,null,null,null,null,null,null,null,null,null,null,null,null,null,null,null,null,null,null,null,null,null,{"$f":"IF(OR(Q774=2,Q774=9,Q774=\"\"),\"X\",\"\")","v":"X"}]
[null,null,"2.1",null,"Servidumbre"]
[null,null,"2.2",null,"Usufructo"]
[null,null,"3.","Patrimonio de familia"]
[null,null,"4.","Capitulaciones matrimoniales"]
[null,null,"5.","Contratos",null,null,null,null,null,null,null,null,null,null,null,null,null,null,null,null,null,null,null,null,null,null,null,null,null,null,null,null,{"$f":"IF(OR(Q779=2,Q779=9,Q779=\"\"),\"X\",\"\")","v":"X"}]
[null,null,"5.1",null,"Arrendamiento"]
[null,null,"5.2",null,"Comodato"]
[null,null,"6.","Fusión o división",null,null,null,null,null,null,null,null,null,null,null,null,null,null,null,null,null,null,null,null,null,null,null,null,null,null,null,null,{"$f":"IF(OR(Q782=2,Q782=9,Q782=\"\"),\"X\",\"\")","v":"X"}]
[null,null,"6.1",null,"Constitución de régimen de propiedad en condominio"]
[null,null,"6.2",null,"División de cosa común (copropiedad)"]
[null,null,"6.3",null,"Fraccionamiento"]
[null,null,"6.4",null,"Fusión de predios"]
[null,null,"6.5",null,"Lotificación"]
[null,null,"6.6",null,"Relotificación"]
[null,null,"6.7",null,"Subdivisión"]
[null,null,"7.","Modificación de medidas y linderos"]
[null,null,"8.","Gravámenes",null,null,null,null,null,null,null,null,null,null,null,null,null,null,null,null,null,null,null,null,null,null,null,null,null,null,null,null,{"$f":"IF(OR(Q791=2,Q791=9,Q791=\"\"),\"X\",\"\")","v":"X"}]
[null,null,"8.1",null,"Cédula hipotecaria"]
[null,null,"8.2",null,"Cesión de crédito hipotecario"]
[null,null,"8.3",null,"Constitución de reserva de dominio"]
[null,null,"8.4",null,"Crédito o hipoteca "]
[null,null,"8.5",null,"Embargo"]
[null,null,"8.6",null,"Fianza"]
[null,null,"8.7",null,"Mutuo con garantía hipotecaria"]
[null,null,"9.","Cancelaciones"]
[null,null,"10.","Otro (especifique)"]
[]
[]
[null,null,"Otro trámite o servicio:\n(especifique)",null,null,null,null,null,null,null,null,null,null,null,null,null,null,null,null,null,null,null,null,null,null,null,null,null,null,null,null,null,null,null,{"$f":"IF(Q800=1,COUNTBLANK(G803),0)","v":0}]
[]
[null,null,"En caso de tener algún comentario u observación al dato registrado en la respuesta de la presente pregunta, o de los datos que derivan de la misma, favor de anotarlo en el siguiente espacio. De lo contrario, déjelo en blanco."]
[]
[]
[]
[]
[]
[]
[]
["2.29.-","Indique si los siguientes tipos de certificados sobre bienes inmuebles se expidieron en la institución registral de la entidad federativa durante el año 2022.",null,null,null,null,null,null,null,null,null,null,null,null,null,null,null,null,null,null,null,null,null,null,null,null,null,null,null,null,null,null,null,null,{"$f":"IF(AND(Q817=1,X817=\"\"),1,0)+IF(AND(Q818=1,X818=\"\"),1,0)+IF(AND(Q819=1,X819=\"\"),1,0)+IF(AND(Q820=1,X820=\"\"),1,0)+IF(AND(Q821=1,X821=\"\"),1,0)+IF(AND(Q822=1,X822=\"\"),1,0)+COUNTBLANK(Q817:Q822)","v":6}]
[null,null,"Si responde \"1. Sí\" en el numeral 6, anote el otro tipo de certificado en el recuadro que está al final de la tabla."]
[]
[null,null,"Certificados ",null,null,null,null,null,null,null,null,null,null,null,null,null,"¿Se expidió el certificado? \n(1.Sí / 2.No / 9.No se sabe)",null,null,null,null,null,null,"Cantidad de certificados expedidos"]
[null,null,"1.","Propiedad o no propiedad"]
[null,null,"2.","Gravamen o libertad de gravamen"]
[null,null,"3.","Inscripción o no inscripción de predio"]
[null,null,"4.","Historia registral"]
[null,null,"5.","Copias certificadas"]
[null,null,"6.","Otro (especifique)"]
[]
[null,null,"Otro tipo de certificado:\n(especifique)",null,null,null,null,null,null,null,null,null,null,null,null,null,null,null,null,null,null,null,null,null,null,null,null,null,null,null,null,null,null,null,{"$f":"IF(Q822=1,COUNTBLANK(G824),0)","v":0}]
[]
[null,null,"En caso de tener algún comentario u observación al dato registrado en la respuesta de la presente pregunta, o de los datos que derivan de la misma, favor de anotarlo en el siguiente espacio. De lo contrario, déjelo en blanco."]
[]
[]
[]
[]
[]
[]
[]
["2.30.-","Indique si durante el año 2022 en la institución registral de la entidad federativa se implementaron alertas inmobiliarias para notificar al titular cuando se dio inicio a un trámite que afectó a su predio.",null,null,null,null,null,null,null,null,null,null,null,null,null,null,null,null,null,null,null,null,null,null,null,null,null,null,null,null,null,null,null,null,{"$f":"IF(COUNTBLANK(C837)+COUNTBLANK(I837)+COUNTBLANK(T837)=3,1,0)","v":1}]
[null,null,"Seleccione con \"X\" un solo código."]
[]
[null,null,null,"1. Sí",null,null,null,null,null,"2. No (pase a la pregunta 2.32)",null,null,null,null,null,null,null,null,null,null,"9. No se sabe (pase a la pregunta 2.32)"]
[]
[null,null,"En caso de tener algún comentario u observación al dato registrado en la respuesta de la presente pregunta, o de los datos que derivan de la misma, favor de anotarlo en el siguiente espacio. De lo contrario, déjelo en blanco."]
[null,null,null,null,null,null,null,null,null,null,null,null,null,null,null,null,null,null,null,null,null,null,null,null,null,null,null,null,null,null,null,null,null,null,null,{"$f":"IF(AK840=1,COUNTBLANK(C840),0)","v":0},0]
[]
[]
[]
[]
[]
[]
["2.31.-","Seleccione los medios que se utilizaron para notificar al titular.",null,null,null,null,null,null,null,null,null,null,null,null,null,null,null,null,null,null,null,null,null,null,null,null,null,null,null,null,null,null,null,null,{"$f":"IF(UPPER(C837)=\"X\",IF(COUNTBLANK(C852:C856)=5,1,0), 0)","v":0}]
[null,null,"Puede seleccionar con \"X\" más de un código."]
[null,null,"Si marca el numeral 4, anote el otro medio en el recuadro que se encuentra al final de la lista."]
[null,null,"Si elige el numeral 9, no marque otro código."]
[]
[null,null,null,"1. Mensaje de texto"]
[null,null,null,"2. Correo electrónico"]
[null,null,null,"3. Aplicación móvil "]
[null,null,null,"4. Otro (especifique)"]
[null,null,null,"9. No se sabe"]
[]
[null,null,"Otro medio:\n(especifique)",null,null,null,null,null,null,null,null,null,null,null,null,null,null,null,null,null,null,null,null,null,null,null,null,null,null,null,null,null,null,null,{"$f":"IF(UPPER(C855=\"X\"),COUNTBLANK(G858),0)","v":0}]
[]
[null,null,"En caso de tener algún comentario u observación al dato registrado en la respuesta de la presente pregunta, o de los datos que derivan de la misma, favor de anotarlo en el siguiente espacio. De lo contrario, déjelo en blanco."]
[]
[]
[]
[]
[]
[]
[]
["2.32.-","Indique si la institución registral de la entidad federativa estableció convenios de servicios electrónicos con los siguientes usuarios durante el año 2022.",null,null,null,null,null,null,null,null,null,null,null,null,null,null,null,null,null,null,null,null,null,null,null,null,null,null,null,null,null,null,null,null,{"$f":"IF(COUNTBLANK(Z872:Z880)>0,1,0)","v":1}]
[null,null,"Si responde \"1. Sí\" en el numeral 9, anote el otro usuario en el recuadro que está al final de la tabla."]
[]
[null,null,"Usuarios",null,null,null,null,null,null,null,null,null,null,null,null,null,null,null,null,null,null,null,null,null,null,"¿Estableció convenio?\n(1.Sí / 2.No / 9.No se sabe)"]
[null,null,"1.","SAT"]
[null,null,"2.","UIF"]
[null,null,"3.","Instituciones catastrales"]
[null,null,"4.","Usuarios institucionales"]
[null,null,"5.","Poder judicial estatal y/o federal"]
[null,null,"6.","Procuraduría y/o fiscalía estatal de justicia"]
[null,null,"7.","Notarios"]
[null,null,"8.","Particulares"]
[null,null,"9.","Otro (especifique)"]
[]
[null,null,"Otro usuario:\n(especifique)",null,null,null,null,null,null,null,null,null,null,null,null,null,null,null,null,null,null,null,null,null,null,null,null,null,null,null,null,null,null,null,{"$f":"IF(Z880=1,COUNTBLANK(G882),0)","v":0}]
[]
[null,null,"En caso de tener algún comentario u observación al dato registrado en la respuesta de la presente pregunta, o de los datos que derivan de la misma, favor de anotarlo en el siguiente espacio. De lo contrario, déjelo en blanco."]
[]
[]
[]
[]
[]
[]
[null,null,null,null,null,null,null,null,null,null,null,null,null,null,null,null,null,null,null,null,null,null,null,null,null,null,null,null,null,null,null,null,null,null,{"$f":"IF(SUM(AI758,AI803,AI813,AI824,AI834,AI847,AI858,AI868,AI882)=0,0,1)","v":1}]
[null,"II.4.1 Inscripciones registrales"]
[null,"Glosario del apartado:"]
[null,null,"1.- Inscripciones registrales: se refiere a aquellos asientos o inscripciones en los que quedan registrados los movimientos que sufren los bienes inmuebles, bienes muebles, actos mercantiles, personas morales de carácter civil o mercantil, entre otros y que pueden o no formar parte de un folio real físico o un folio real electrónico."]
[]
["2.33.-","Anote, conforme a la siguiente tabla, el universo de inscripciones registrales, legajos y/o libros generados, así como el porcentaje de los que se encontraban en formato digital y/o físico al cierre del año 2022. ",null,null,null,null,null,null,null,null,null,null,null,null,null,null,null,null,null,null,null,null,null,null,null,null,null,null,null,null,null,null,null,null,{"$f":"IF(AND(P903>0,UPPER(P903)<>\"NS\",OR(U903=\"\",Z903=\"\")),1,0)+IF(AND(P904>0,UPPER(P904)<>\"NS\",OR(U904=\"\",Z904=\"\")),1,0)+IF(AND(P905>0,UPPER(P905)<>\"NS\",OR(U905=\"\",Z905=\"\")),1,0)+COUNTBLANK(P903:P905)","v":3}]
[null,null,"Si desconoce alguna cantidad, registre \"NS\" en la celda correspondiente."]
[null,null,"Registre el porcentaje de los formatos en números enteros sin el símbolo de porcentaje (%)."]
[null,null,"Los porcentajes registrados en las columnas de formato digital y físico no son sumables. En cada una de ellas puede registrar hasta el 100% si es el caso."]
[]
[null,null,"Elementos",null,null,null,null,null,null,null,null,null,null,null,null,"Universo",null,null,null,null,"Formato"]
[null,null,null,null,null,null,null,null,null,null,null,null,null,null,null,null,null,null,null,null,"% Digital",null,null,null,null,"% Físico"]
[null,null,"1.","Inscripciones registrales",null,null,null,null,null,null,null,null,null,null,null,null,null,null,null,null,null,null,null,null,null,null,null,null,null,null,null,null,0,0,0]
[null,null,"2.","Legajos",null,null,null,null,null,null,null,null,null,null,null,null,null,null,null,null,null,null,null,null,null,null,null,null,null,null,null,null,0,0,0]
[null,null,"3.","Libros",null,null,null,null,null,null,null,null,null,null,null,null,null,null,null,null,null,null,null,null,null,null,null,null,null,null,null,null,0,0,0]
[]
[null,null,"En caso de tener algún comentario u observación al dato registrado en la respuesta de la presente pregunta, o de los datos que derivan de la misma, favor de anotarlo en el siguiente espacio. De lo contrario, déjelo en blanco."]
[null,null,null,null,null,null,null,null,null,null,null,null,null,null,null,null,null,null,null,null,null,null,null,null,null,null,null,null,null,null,null,null,null,null,null,{"$f":"IF(AK908=1,COUNTBLANK(C908),0)","v":0},0]
[]
[]
[]
[]
[]
[]
["2.34.-","Anote la cantidad total de bienes inmuebles inscritos en la institución registral de la entidad federativa al cierre del año 2022.",null,null,null,null,null,null,null,null,null,null,null,null,null,null,null,null,null,null,null,null,null,null,null,null,null,null,null,null,null,null,null,null,{"$f":"IF(COUNTBLANK(C919)+COUNTBLANK(N919)=2,1,0)","v":1}]
[null,null,"Registre la cantidad de bienes inmuebles inscritos omitiendo duplicados."]
[null,null,"La cantidad debe registrarse con números enteros y sin comas."]
[]
[null,null,null,null,null,null,null,null,null,null,null,"",null,null,"9. No se sabe"]
[]
[null,null,"En caso de tener algún comentario u observación al dato registrado en la respuesta de la presente pregunta, o de los datos que derivan de la misma, favor de anotarlo en el siguiente espacio. De lo contrario, déjelo en blanco."]
[null,null,null,null,null,null,null,null,null,null,null,null,null,null,null,null,null,null,null,null,null,null,null,null,null,null,null,null,null,null,null,null,null,null,null,{"$f":"IF(AK922=1,COUNTBLANK(C922),0)","v":0},0]
[]
[]
[]
[]
[]
[null,null,null,null,null,null,null,null,null,null,null,null,null,null,null,null,null,null,null,null,null,null,null,null,null,null,null,null,null,null,null,null,null,null,null,null,0]
["2.35.-","Indique si se implementó el folio real físico en la institución registral de la entidad federativa al cierre del año 2022.",null,null,null,null,null,null,null,null,null,null,null,null,null,null,null,null,null,null,null,null,null,null,null,null,null,null,null,null,null,null,null,null,{"$f":"IF(COUNTBLANK(C933)+COUNTBLANK(N933)+COUNTBLANK(T933)=3,1,IF(UPPER(C933)=\"X\",COUNTBLANK(H933),0))","v":1}]
[null,null,"Seleccione con \"X\" un solo código."]
[null,null,"Si marca el código \"1.Sí\", indique el porcentaje de oficinas de la institución registral en las que se implementó el folio real físico."]
[]
[null,null,null,"1.Sí. ¿Porcentaje?",null,null,null,null,null,null,null,null,null,null,"2.No (pase a la pregunta 2.38)",null,null,null,null,null,"9.No se sabe (pase a la pregunta 2.38)"]
[]
[null,null,"En caso de tener algún comentario u observación al dato registrado en la respuesta de la presente pregunta, o de los datos que derivan de la misma, favor de anotarlo en el siguiente espacio. De lo contrario, déjelo en blanco."]
[null,null,null,null,null,null,null,null,null,null,null,null,null,null,null,null,null,null,null,null,null,null,null,null,null,null,null,null,null,null,null,null,null,null,null,{"$f":"IF(AK936=1,COUNTBLANK(C936),0)","v":0},0]
[]
[]
[]
[]
[]
[]
["2.36.-","Anote la cantidad total de folios reales físicos generados en la institución registral de la entidad federativa al cierre del año 2022.",null,null,null,null,null,null,null,null,null,null,null,null,null,null,null,null,null,null,null,null,null,null,null,null,null,null,null,null,null,null,null,null,{"$f":"IF(UPPER(C933)=\"X\",IF(COUNTBLANK(C947)+COUNTBLANK(N947)=2,1,0),0)","v":0}]
[null,null,"Registre la cantidad de folios reales físicos vigentes generados, omitiendo duplicados."]
[null,null,"La cantidad debe registrarse con números enteros y sin comas."]
[]
[null,null,null,null,null,null,null,null,null,null,null,"",null,null,"9. No se sabe  (pase a la pregunta 2.38)",null,null,null,null,null,null,null,null,null,null,null,null,null,null,null,null,null,null,null,null,null,0]
[]
[null,null,"En caso de tener algún comentario u observación al dato registrado en la respuesta de la presente pregunta, o de los datos que derivan de la misma, favor de anotarlo en el siguiente espacio. De lo contrario, déjelo en blanco."]
[null,null,null,null,null,null,null,null,null,null,null,null,null,null,null,null,null,null,null,null,null,null,null,null,null,null,null,null,null,null,null,null,null,null,null,{"$f":"IF(AK950=1,COUNTBLANK(C950),0)","v":0},0]
[]
[]
[]
[]
[]
[]
["2.37.-","Anote la cantidad total de folios reales físicos por tipo, generados en la institución registral de la entidad federativa al cierre del año 2022.",null,null,null,null,null,null,null,null,null,null,null,null,null,null,null,null,null,null,null,null,null,null,null,null,null,null,null,null,null,null,null,null,{"$f":"IF(AND(C947>0,C947<>\"\"),COUNTBLANK(K964)+COUNTBLANK(O964)+COUNTBLANK(S964)+COUNTBLANK(W964)+COUNTBLANK(AA964),0)","v":0}]
[null,null,"La cantidad total de folios reales físicos debe ser igual a la registrada como respuesta de la pregunta 2.36."]
[null,null,"Si registra información en la columna \"Otro\", anote el otro tipo de folio real físico en el recuadro de comentarios generales."]
[]
[null,null,"Tipo de folio real físico"]
[null,null,"Total de folios",null,null,null,null,null,null,null,"Subtotal "]
[null,null,null,null,null,null,null,null,null,null,"Folio inmobiliario",null,null,null,"Folio mobiliario",null,null,null,"Folio de persona moral de carácter civil",null,null,null,"Otro",null,null,null,"Sin clasificación"]
[null,null,{"$f":"IF(C947<>\"\",C947,\"\")","v":""}]
[]
[null,null,"En caso de tener algún comentario u observación al dato registrado en la respuesta de la presente pregunta, o de los datos que derivan de la misma, favor de anotarlo en el siguiente espacio. De lo contrario, déjelo en blanco."]
[]
[]
[]
[]
[]
[]
[]
["2.38.-","Indique si se implementó el folio real electrónico en la institución registral de la entidad federativa al cierre del año 2022.",null,null,null,null,null,null,null,null,null,null,null,null,null,null,null,null,null,null,null,null,null,null,null,null,null,null,null,null,null,null,null,null,{"$f":"IF(COUNTBLANK(C978)+COUNTBLANK(N978)+COUNTBLANK(T978)=3,1,IF(UPPER(C978)=\"X\",COUNTBLANK(H978),0))","v":1}]
[null,null,"Seleccione con \"X\" un solo código."]
[null,null,"Si marca el código \"1.Sí\", indique el porcentaje de oficinas de la institución registral en las que se implementó el folio real electrónico."]
[]
[null,null,null,"1.Sí. ¿Porcentaje?",null,null,null,null,null,null,null,null,null,null,"2.No (Pase a la pregunta 2.42)",null,null,null,null,null,"9.No se sabe (Pase a la pregunta 2.42)"]
[]
[null,null,"En caso de tener algún comentario u observación al dato registrado en la respuesta de la presente pregunta, o de los datos que derivan de la misma, favor de anotarlo en el siguiente espacio. De lo contrario, déjelo en blanco."]
[null,null,null,null,null,null,null,null,null,null,null,null,null,null,null,null,null,null,null,null,null,null,null,null,null,null,null,null,null,null,null,null,null,null,null,{"$f":"IF(AK981=1,COUNTBLANK(C981),0)","v":0},0]
[]
[]
[]
[]
[]
[]
["2.39.-","Anote la cantidad total de folios reales electrónicos generados en la institución registral de la entidad federativa al cierre del año 2022.",null,null,null,null,null,null,null,null,null,null,null,null,null,null,null,null,null,null,null,null,null,null,null,null,null,null,null,null,null,null,null,null,{"$f":"IF(UPPER(C978)=\"X\",IF(COUNTBLANK(C992)+COUNTBLANK(N992)=2,1,0),0)","v":0}]
[null,null,"Registre la cantidad de folios reales electrónicos vigentes generados, omitiendo duplicados."]
[null,null,"La cantidad debe registrarse con números enteros y sin comas."]
[]
[null,null,null,null,null,null,null,null,null,null,null,"",null,null,"9. No se sabe  (pase a la pregunta 2.41)",null,null,null,null,null,null,null,null,null,null,null,null,null,null,null,null,null,null,null,null,null,0]
[]
[null,null,"En caso de tener algún comentario u observación al dato registrado en la respuesta de la presente pregunta, o de los datos que derivan de la misma, favor de anotarlo en el siguiente espacio. De lo contrario, déjelo en blanco."]
[null,null,null,null,null,null,null,null,null,null,null,null,null,null,null,null,null,null,null,null,null,null,null,null,null,null,null,null,null,null,null,null,null,null,null,{"$f":"IF(AK995=1,COUNTBLANK(C995),0)","v":0},0]
[]
[]
[]
[]
[]
[]
["2.40.-","Anote la cantidad total de folios reales electrónicos por tipo, generados en la institución registral de la entidad federativa al cierre del año 2022.",null,null,null,null,null,null,null,null,null,null,null,null,null,null,null,null,null,null,null,null,null,null,null,null,null,null,null,null,null,null,null,null,{"$f":"IF(AND(C992>0,C992<>\"\"),COUNTBLANK(K1009)+COUNTBLANK(O1009)+COUNTBLANK(S1009)+COUNTBLANK(W1009)+COUNTBLANK(AA1009),0)","v":0}]
[null,null,"La cantidad total de folios reales electrónicos debe ser igual a la registrada como respuesta de la pregunta 2.39."]
[null,null,"Si registra información en la columna \"Otro\", anote el otro tipo de folio real electrónico en el recuadro de comentarios generales."]
[]
[null,null,"Tipo de folio real electrónico"]
[null,null,"Total de folios",null,null,null,null,null,null,null,"Subtotal "]
[null,null,null,null,null,null,null,null,null,null,"Folio inmobiliario",null,null,null,"Folio mobiliario",null,null,null,"Folio de persona moral de carácter civil",null,null,null,"Otro",null,null,null,"Sin clasificación"]
[null,null,{"$f":"IF(C992<>\"\",C992,\"\")","v":""}]
[]
[null,null,"En caso de tener algún comentario u observación al dato registrado en la respuesta de la presente pregunta, o de los datos que derivan de la misma, favor de anotarlo en el siguiente espacio. De lo contrario, déjelo en blanco."]
[]
[]
[]
[]
[]
[]
[]
["2.41.-","Indique si los siguientes componentes integraron el folio real electrónico durante el año 2022. ",null,null,null,null,null,null,null,null,null,null,null,null,null,null,null,null,null,null,null,null,null,null,null,null,null,null,null,null,null,null,null,null,{"$f":"IF(UPPER(C978)=\"X\",IF(AND(Z1024=1,OR(Z1025=\"\",Z1026=\"\",Z1027=\"\",Z1030=\"\",Z1031=\"\",Z1032=\"\",Z1033=\"\",Z1035=\"\",Z1036=\"\",Z1037=\"\",Z1039=\"\",Z1040=\"\",Z1041=\"\",Z1043=\"\",Z1044=\"\",Z1045=\"\")),1,0)+IF(AND(Z1046=1,OR(Z1047=\"\",Z1048=\"\")),1,0)+IF(AND(Z1049=1,OR(Z1050=\"\",Z1051=\"\",Z1052=\"\",Z1053=\"\",Z1054=\"\",Z1055=\"\",Z1056=\"\")),1,0)+IF(AND(Z1057=1,OR(Z1058=\"\",Z1059=\"\",Z1060=\"\",Z1061=\"\",Z1062=\"\",Z1063=\"\",Z1064=\"\")),1,0)+IF(AND(Z1065=1,OR(Z1066=\"\",Z1067=\"\",Z1068=\"\",Z1069=\"\",Z1070=\"\")),1,0)+IF(AND(Z1024=1,Z1027=1,OR(Z1028=\"\",Z1029=\"\")),1,0)+IF(AND(Z1024=1,Z1033=1,Z1034=\"\"),1,0)+IF(AND(Z1024=1,Z1037=1,Z1038=\"\"),1,0)+IF(AND(Z1024=1,Z1041=1,Z1042=\"\"),1,0)+COUNTBLANK(Z1023)+COUNTBLANK(Z1024)+COUNTBLANK(Z1046)+COUNTBLANK(Z1049)+COUNTBLANK(Z1057)+COUNTBLANK(Z1065)+COUNTBLANK(Z1071)+COUNTBLANK(Z1072)+COUNTBLANK(Z1073)+COUNTBLANK(Z1074)+COUNTBLANK(Z1075)+COUNTBLANK(Z1076),0)","v":0}]
[null,null,"Si responde \"1. Sí\" en el numeral 12, anote el otro componente en el recuadro que se encuentra al final de la tabla."]
[]
[null,null,"Componentes del folio real electrónico",null,null,null,null,null,null,null,null,null,null,null,null,null,null,null,null,null,null,null,null,null,null,"¿Integró el folio real electrónico?\n(1.Sí / 2.No / 9.No se sabe)"]
[null,null,"1.","Clave numérica o alfanumérica para identificación del folio"]
[null,null,"2.","Datos de identificación",null,null,null,null,null,null,null,null,null,null,null,null,null,null,null,null,null,null,null,null,null,null,null,null,null,null,null,null,{"$f":"IF(Z1024=1,\"\",\"X\")","v":"X"}]
[null,null,"2.1",null,"Clave catastral estándar"]
[null,null,"2.2",null,"Cuenta predial"]
[null,null,"2.3",null,"Superficie"]
[null,null,"2.3.1",null,null,"Unidad de medida "]
[null,null,"2.3.2",null,null,"Equivalencia en metros"]
[null,null,"2.4",null,"Linderos"]
[null,null,"2.5",null,"Medidas"]
[null,null,"2.6",null,"Colindancias"]
[null,null,"2.7",null,"Calle o vialidad"]
[null,null,"2.7.1",null,null,"Tipo de vialidad"]
[null,null,"2.8",null,"Número exterior"]
[null,null,"2.9",null,"Número interior"]
[null,null,"2.10",null,"Edificio"]
[null,null,"2.10.1",null,"Nivel","Nivel"]
[null,null,"2.11",null,"Lote"]
[null,null,"2.12",null,"Manzana "]
[null,null,"2.13",null,"Colonia, fraccionamiento o condominio"]
[null,null,"2.13.1",null,null,"Etapa o sección"]
[null,null,"2.14",null,"Localidad"]
[null,null,"2.15",null,"Municipio"]
[null,null,"2.16",null,"Entidad federativa"]
[null,null,"3.","Titularidad"]
[null,null,"3.1",null,"Nombre del titular"]
[null,null,"3.2",null,"Razón social en caso de persona moral como titular "]
[null,null,"4.","Datos de la última inscripción"]
[null,null,"4.1",null,"Oficina"]
[null,null,"4.2",null,"Sección"]
[null,null,"4.3",null,"Libro "]
[null,null,"4.4",null,"Año"]
[null,null,"4.5",null,"Volumen"]
[null,null,"4.6",null,"Número de asiento o inscripción"]
[null,null,"4.7",null,"Fecha de registro"]
[null,null,"5.","Antecedentes"]
[null,null,"5.1",null,"Folio originario/matriz"]
[null,null,"5.2",null,"Oficina"]
[null,null,"5.3",null,"Sección"]
[null,null,"5.4",null,"Libro "]
[null,null,"5.5",null,"Año"]
[null,null,"5.6",null,"Volumen"]
[null,null,"5.7",null,"Número de asiento o inscripción"]
[null,null,"6.","Datos notariales"]
[null,null,"6.1",null,"Notario o autoridad competente que emitió el documento"]
[null,null,"6.2",null,"Folio del asiento o inscripción notarial"]
[null,null,"6.3",null,"Libro notarial"]
[null,null,"6.4",null,"Fecha del instrumento notarial"]
[null,null,"6.5",null,"Número del instrumento notarial"]
[null,null,"7.","Formas precodificadas para las nuevas inscripciones"]
[null,null,"8.","Formas precodificadas para las anotaciones preventivas"]
[null,null,"9.","Formas precodificadas para las anotaciones marginales"]
[null,null,"10.","Gravámenes vigentes"]
[null,null,"11.","Imágenes digitalizadas asociadas y/o indexadas"]
[null,null,"12.","Otro (especifique)"]
[]
[null,null,"Otro componente:\n(especifique)",null,null,null,null,null,null,null,null,null,null,null,null,null,null,null,null,null,null,null,null,null,null,null,null,null,null,null,null,null,null,null,{"$f":"IF(Z1076=1,COUNTBLANK(G1078),0)","v":0}]
[]
[null,null,"En caso de tener algún comentario u observación al dato registrado en la respuesta de la presente pregunta, o de los datos que derivan de la misma, favor de anotarlo en el siguiente espacio. De lo contrario, déjelo en blanco."]
[]
[]
[]
[]
[]
[]
[]
["2.42.-","Indique si en la institución registral de la entidad federativa se implementó el uso de la Cédula Única Catastral y Registral establecida en la Norma Técnica para la Generación, Captación e Integración de Datos Catastrales y Registrales con fines estadísticos y geográficos del INEGI durante el año 2022.",null,null,null,null,null,null,null,null,null,null,null,null,null,null,null,null,null,null,null,null,null,null,null,null,null,null,null,null,null,null,null,null,{"$f":"IF(COUNTBLANK(C1091)+COUNTBLANK(I1091)+COUNTBLANK(T1091)=3,1,0)","v":1}]
[null,null,"Seleccione con \"X\" un solo código."]
[]
[null,null,null,"1. Sí",null,null,null,null,null,"2. No ",null,null,null,null,null,null,null,null,null,null,"9. No se sabe"]
[]
[null,null,"En caso de tener algún comentario u observación al dato registrado en la respuesta de la presente pregunta, o de los datos que derivan de la misma, favor de anotarlo en el siguiente espacio. De lo contrario, déjelo en blanco."]
[]
[]
[]
[]
[]
[]
[]
["2.43.-","Seleccione los tipos de anotaciones preventivas que se realizaron en la institución registral de la entidad federativa durante el año 2022.",null,null,null,null,null,null,null,null,null,null,null,null,null,null,null,null,null,null,null,null,null,null,null,null,null,null,null,null,null,null,null,null,{"$f":"IF(COUNTBLANK(C1106:C1118)=13,1,0)","v":1}]
[null,null,"Puede seleccionar con \"X\" más de un código."]
[null,null,"Si marca el numeral 11, anote el otro tipo de anotación preventiva en el recuadro que se encuentra al final de la lista."]
[null,null,"Si elige el numeral 12 o el 99, no marque otro código."]
[]
[null,null,null,"1. Las demandas relativas a la propiedad de bienes inmuebles o a la constitución, declaración, modificación o extinción de cualquier derecho real sobre aquellos"]
[null,null,null,"2. El mandamiento y el acta de embargo, que se haya hecho efectivo en bienes inmuebles del deudor"]
[null,null,null,"3. Las demandas promovidas para exigir el cumplimiento de contratos preparatorios o para dar forma legal al acto o contrato concertado, cuando tenga por objeto inmuebles o derechos reales sobre los mismos"]
[null,null,null,"4. Las providencias judiciales que ordenen el secuestro o prohíban la enajenación de bienes inmuebles o derechos reales"]
[null,null,null,"5. Los títulos presentados a la institución registral y cuya inscripción haya sido denegada o suspendida por el registrador"]
[null,null,null,"6. Las anotaciones notariales"]
[null,null,null,"7. La declaración de expropiación"]
[null,null,null,"8. La declaración de utilidad pública"]
[null,null,null,"9. Las fianzas legales o judiciales"]
[null,null,null,"10. Las cédulas hipotecarias"]
[null,null,null,"11. Otro (especifique)"]
[null,null,null,"12. Ninguno"]
[null,null,null,"99. No se sabe"]
[]
[null,null,"Otro tipo de anotación preventiva:\n(especifique)",null,null,null,null,null,null,null,null,null,null,null,null,null,null,null,null,null,null,null,null,null,null,null,null,null,null,null,null,null,null,null,{"$f":"IF(UPPER(C1116=\"X\"),COUNTBLANK(G1120),0)","v":0}]
[]
[null,null,"En caso de tener algún comentario u observación al dato registrado en la respuesta de la presente pregunta, o de los datos que derivan de la misma, favor de anotarlo en el siguiente espacio. De lo contrario, déjelo en blanco."]
[]
[]
[]
[]
[]
[]
[]
["2.44.-","Seleccione los tipos de anotaciones marginales que se realizaron en la institución registral de la entidad federativa durante el año 2022.",null,null,null,null,null,null,null,null,null,null,null,null,null,null,null,null,null,null,null,null,null,null,null,null,null,null,null,null,null,null,null,null,{"$f":"IF(COUNTBLANK(C1135:C1163)=29,1,0)","v":1}]
[null,null,"Puede seleccionar con \"X\" más de un código."]
[null,null,"Si marca el numeral 27, anote el otro tipo de anotación marginal en el recuadro que está al final de la lista."]
[null,null,"Si elige el numeral 28 o el 99, no marque otro código."]
[]
[null,null,null,"1. Las anotaciones marginales de preferencia o prelación registral"]
[null,null,null,"2. Las anotaciones de embargo"]
[null,null,null,"3. Las anotaciones relativas al otorgamiento de fianzas y cancelación de las mismas"]
[null,null,null,"4. Las anotaciones de referencia de otras inscripciones que tengan relación con la principal a la que se refieren"]
[null,null,null,"5. Las cancelaciones de las anotaciones marginales y de las inscripciones definitivas"]
[null,null,null,"6. La cancelación de una inscripción o anotación preventiva"]
[null,null,null,"7. Las suspensiones provisionales, preventivas o definitivas provenientes de juicios de amparo"]
[null,null,null,"8. Los acuerdos emitidos en cumplimiento de una ejecutoria de amparo, cuando proceda"]
[null,null,null,"9. El acuerdo en que se impugne alguna inscripción hecha en la institución ordenada por la autoridad competente"]
[null,null,null,"10. El escrito del usuario por el que presentó recurso ante la autoridad competente, ante la negativa de inscripción o cancelación, solicitando a la autoridad registral que prolongue los efectos de la anotación marginal preventiva de preferencia"]
[null,null,null,"11. Las resoluciones en que se admita una demanda, cuyos efectos, en caso de prosperar, alteren la situación jurídica de los bienes o derechos cuya inscripción sea indispensable en la institución registral"]
[null,null,null,"12. Las resoluciones emitidas por la autoridad competente, aclarando, rectificando o modificando el acto celebrado y su declaración registral"]
[null,null,null,"13. Las órdenes de intervención sobre determinada inscripción que realicen las autoridades competentes o por el ministerio público"]
[null,null,null,"14. Los testimonios en alcance que emita el notario, aclarando o rectificando un error cometido al celebrar el acto inscrito"]
[null,null,null,"15. El título traslativo de dominio de un inmueble perteneciente a un fraccionamiento o parte de él"]
[null,null,null,"16. Los derechos reales"]
[null,null,null,"17. La división de una finca"]
[null,null,null,"18. Los testamentos, los autos declaratorios de herederos, el nombramiento de albacea definitivo, el auto por el cual se le discierna el cargo"]
[null,null,null,"19. Las cesiones de derechos hereditarios en concreto y en abstracto"]
[null,null,null,"20. Las capitulaciones matrimoniales"]
[null,null,null,"21. Los contratos de arrendamiento"]
[null,null,null,"22. Los planes de desarrollo urbano"]
[null,null,null,"23. Los derechos de uso respecto de inmuebles de propiedad federal"]
[null,null,null,"24. Las rectificaciones"]
[null,null,null,"25. Las segregaciones o subdivisiones"]
[null,null,null,"26. Las transmisiones"]
[null,null,null,"27. Otro (especifique)"]
[null,null,null,"28. Ninguno"]
[null,null,null,"99. No se sabe"]
[]
[null,null,"Otro tipo de anotación marginal: \n(especifique)",null,null,null,null,null,null,null,null,null,null,null,null,null,null,null,null,null,null,null,null,null,null,null,null,null,null,null,null,null,null,null,{"$f":"IF(UPPER(C1161=\"X\"),COUNTBLANK(G1165),0)","v":0}]
[]
[null,null,"En caso de tener algún comentario u observación al dato registrado en la respuesta de la presente pregunta, o de los datos que derivan de la misma, favor de anotarlo en el siguiente espacio. De lo contrario, déjelo en blanco."]
[]
[]
[]
[]
[]
[]
[]
["2.45.-","Indique si durante el año 2022 en la institución registral de la entidad federativa se realizó la rectificación de asientos o inscripciones registrales.",null,null,null,null,null,null,null,null,null,null,null,null,null,null,null,null,null,null,null,null,null,null,null,null,null,null,null,null,null,null,null,null,{"$f":"IF(COUNTBLANK(C1178)+COUNTBLANK(I1178)+COUNTBLANK(T1178)=3,1,0)","v":1}]
[null,null,"Seleccione con \"X\" un solo código."]
[]
[null,null,null,"1. Sí",null,null,null,null,null,"2. No (pase a la pregunta 2.50)",null,null,null,null,null,null,null,null,null,null,"9. No se sabe (pase a la pregunta 2.50)"]
[]
[null,null,"En caso de tener algún comentario u observación al dato registrado en la respuesta de la presente pregunta, o de los datos que derivan de la misma, favor de anotarlo en el siguiente espacio. De lo contrario, déjelo en blanco."]
[]
[]
[]
[]
[]
[]
[]
["2.46.-","Seleccione los medios por los cuales se inició la rectificación de asientos o inscripciones registrales durante el año 2022.",null,null,null,null,null,null,null,null,null,null,null,null,null,null,null,null,null,null,null,null,null,null,null,null,null,null,null,null,null,null,null,null,{"$f":"IF(UPPER(C1178)=\"X\",IF(COUNTBLANK(C1193:C1197)=5,1,0), 0)","v":0}]
[null,null,"Puede seleccionar con \"X\" más de un código."]
[null,null,"Si marca el numeral 4, anote el otro medio en el recuadro que está al final de la lista."]
[null,null,"Si elige el numeral 9, no marque otro código."]
[]
[null,null,null,"1. De oficio"]
[null,null,null,"2. A petición de parte"]
[null,null,null,"3. Por orden judicial o administrativa"]
[null,null,null,"4. Otro (especifique)"]
[null,null,null,"9. No se sabe"]
[]
[null,null,"Otro medio:\n(especifique)",null,null,null,null,null,null,null,null,null,null,null,null,null,null,null,null,null,null,null,null,null,null,null,null,null,null,null,null,null,null,null,{"$f":"IF(UPPER(C1196=\"X\"),COUNTBLANK(G1199),0)","v":0}]
[]
[null,null,"En caso de tener algún comentario u observación al dato registrado en la respuesta de la presente pregunta, o de los datos que derivan de la misma, favor de anotarlo en el siguiente espacio. De lo contrario, déjelo en blanco."]
[]
[]
[]
[]
[]
[]
[]
["2.47.-","Seleccione las formas en que se realizó la rectificación de asientos o inscripciones registrales durante el año 2022.",null,null,null,null,null,null,null,null,null,null,null,null,null,null,null,null,null,null,null,null,null,null,null,null,null,null,null,null,null,null,null,null,{"$f":"IF(UPPER(C1178)=\"X\",IF(COUNTBLANK(C1214:C1218)=5,1,0), 0)","v":0}]
[null,null,"Puede seleccionar con \"X\" más de un código."]
[null,null,"Si marca el numeral 4, anote la otra forma en el recuadro que está al final de la lista."]
[null,null,"Si elige el numeral 9, no marque otro código."]
[]
[null,null,null,"1. Sobre la misma inscripción"]
[null,null,null,"2. Generando una nueva inscripción"]
[null,null,null,"3. Generando una nueva inscripción correlacionada con la sujeta a rectificación"]
[null,null,null,"4. Otra (especifique)"]
[null,null,null,"9. No se sabe"]
[]
[null,null,"Otra forma:\n(especifique)",null,null,null,null,null,null,null,null,null,null,null,null,null,null,null,null,null,null,null,null,null,null,null,null,null,null,null,null,null,null,null,{"$f":"IF(UPPER(C1218=\"X\"),COUNTBLANK(G1220),0)","v":0}]
[]
[null,null,"En caso de tener algún comentario u observación al dato registrado en la respuesta de la presente pregunta, o de los datos que derivan de la misma, favor de anotarlo en el siguiente espacio. De lo contrario, déjelo en blanco."]
[]
[]
[]
[]
[]
[]
[]
["2.48.-","Indique si durante el año 2022 se suspendieron los trámites en proceso sobre los asientos o inscripciones registrales hasta que se concluyó la rectificación.",null,null,null,null,null,null,null,null,null,null,null,null,null,null,null,null,null,null,null,null,null,null,null,null,null,null,null,null,null,null,null,null,{"$f":"IF(UPPER(C1178)=\"X\",IF(COUNTBLANK(C1233)+COUNTBLANK(I1233)+COUNTBLANK(T1233)=3,1,0),0)","v":0}]
[null,null,"Seleccione con \"X\" un solo código."]
[]
[null,null,null,"1. Sí",null,null,null,null,null,"2. No",null,null,null,null,null,null,null,null,null,null,"9. No se sabe"]
[]
[null,null,"En caso de tener algún comentario u observación al dato registrado en la respuesta de la presente pregunta, o de los datos que derivan de la misma, favor de anotarlo en el siguiente espacio. De lo contrario, déjelo en blanco."]
[]
[]
[]
[]
[]
[]
[]
["2.49.-","Indique si durante el año 2022 al realizar la rectificación de asientos o inscripciones registrales también se corrigieron los asientos o inscripciones registrales relacionados y que tuvieron el mismo error.",null,null,null,null,null,null,null,null,null,null,null,null,null,null,null,null,null,null,null,null,null,null,null,null,null,null,null,null,null,null,null,null,{"$f":"IF(UPPER(C1178)=\"X\",IF(COUNTBLANK(C1246)+COUNTBLANK(I1246)+COUNTBLANK(T1246)=3,1,0),0)","v":0}]
[null,null,"Seleccione con \"X\" un solo código."]
[]
[null,null,null,"1. Sí",null,null,null,null,null,"2. No",null,null,null,null,null,null,null,null,null,null,"9. No se sabe"]
[]
[null,null,"En caso de tener algún comentario u observación al dato registrado en la respuesta de la presente pregunta, o de los datos que derivan de la misma, favor de anotarlo en el siguiente espacio. De lo contrario, déjelo en blanco."]
[]
[]
[]
[]
[]
[]
[]
["2.50.-","Indique si durante el año 2022 en la institución registral de la entidad federativa se realizó la reposición de asientos o inscripciones registrales.",null,null,null,null,null,null,null,null,null,null,null,null,null,null,null,null,null,null,null,null,null,null,null,null,null,null,null,null,null,null,null,null,{"$f":"IF(COUNTBLANK(C1259)+COUNTBLANK(I1259)+COUNTBLANK(T1259)=3,1,0)","v":1}]
[null,null,"Seleccione con \"X\" un solo código."]
[]
[null,null,null,"1. Sí",null,null,null,null,null,"2. No (pase a la pregunta 2.54)",null,null,null,null,null,null,null,null,null,null,"9. No se sabe (pase a la pregunta 2.54)"]
[]
[null,null,"En caso de tener algún comentario u observación al dato registrado en la respuesta de la presente pregunta, o de los datos que derivan de la misma, favor de anotarlo en el siguiente espacio. De lo contrario, déjelo en blanco."]
[]
[]
[]
[]
[]
[]
[]
["2.51.-","Seleccione los motivos por los cuales se inició la reposición de asientos o inscripciones registrales durante el año 2022.",null,null,null,null,null,null,null,null,null,null,null,null,null,null,null,null,null,null,null,null,null,null,null,null,null,null,null,null,null,null,null,null,{"$f":"IF(UPPER(C1259)=\"X\",IF(COUNTBLANK(C1274:C1278)=5,1,0), 0)","v":0}]
[null,null,"Puede seleccionar con \"X\" más de un código."]
[null,null,"Si marca el numeral 4, anote el otro motivo en el recuadro que está al final de la lista."]
[null,null,"Si elige el numeral 9, no marque otro código."]
[]
[null,null,null,"1. Pérdida y/o extravío"]
[null,null,null,"2. Destrucción total o parcial (mutilación)"]
[null,null,null,"3. Deterioro"]
[null,null,null,"4. Otro (especifique)"]
[null,null,null,"9. No se sabe"]
[]
[null,null,"Otro motivo:\n(especifique)",null,null,null,null,null,null,null,null,null,null,null,null,null,null,null,null,null,null,null,null,null,null,null,null,null,null,null,null,null,null,null,{"$f":"IF(UPPER(C1277=\"X\"),COUNTBLANK(G1280),0)","v":0}]
[]
[null,null,"En caso de tener algún comentario u observación al dato registrado en la respuesta de la presente pregunta, o de los datos que derivan de la misma, favor de anotarlo en el siguiente espacio. De lo contrario, déjelo en blanco."]
[]
[]
[]
[]
[]
[]
[]
["2.52.-","Seleccione los medios por los cuales se inició la reposición de asientos o inscripciones registrales durante el año 2022.",null,null,null,null,null,null,null,null,null,null,null,null,null,null,null,null,null,null,null,null,null,null,null,null,null,null,null,null,null,null,null,null,{"$f":"IF(UPPER(C1259)=\"X\",IF(COUNTBLANK(C1295:C1299)=5,1,0), 0)","v":0}]
[null,null,"Puede seleccionar con \"X\" más de un código."]
[null,null,"Si marca el numeral 4, anote el otro medio en el recuadro que está al final de la lista."]
[null,null,"Si elige el numeral 9, no marque otro código."]
[]
[null,null,null,"1. De oficio"]
[null,null,null,"2. A petición de parte"]
[null,null,null,"3. Por orden judicial o administrativa"]
[null,null,null,"4. Otro (especifique)"]
[null,null,null,"9. No se sabe"]
[]
[null,null,"Otro medio:\n(especifique)",null,null,null,null,null,null,null,null,null,null,null,null,null,null,null,null,null,null,null,null,null,null,null,null,null,null,null,null,null,null,null,{"$f":"IF(UPPER(C1298=\"X\"),COUNTBLANK(G1301),0)","v":0}]
[]
[null,null,"En caso de tener algún comentario u observación al dato registrado en la respuesta de la presente pregunta, o de los datos que derivan de la misma, favor de anotarlo en el siguiente espacio. De lo contrario, déjelo en blanco."]
[]
[]
[]
[]
[]
[]
[]
["2.53.-","Indique si durante el año 2022 se suspendieron los trámites en proceso sobre los asientos o inscripciones registrales hasta que se concluyó la reposición.",null,null,null,null,null,null,null,null,null,null,null,null,null,null,null,null,null,null,null,null,null,null,null,null,null,null,null,null,null,null,null,null,{"$f":"IF(UPPER(C1259)=\"X\",IF(COUNTBLANK(C1314)+COUNTBLANK(I1314)+COUNTBLANK(T1314)=3,1,0),0)","v":0}]
[null,null,"Seleccione con \"X\" un solo código."]
[]
[null,null,null,"1. Sí",null,null,null,null,null,"2. No",null,null,null,null,null,null,null,null,null,null,"9. No se sabe"]
[]
[null,null,"En caso de tener algún comentario u observación al dato registrado en la respuesta de la presente pregunta, o de los datos que derivan de la misma, favor de anotarlo en el siguiente espacio. De lo contrario, déjelo en blanco."]
[]
[]
[]
[]
[]
[]
[]
["2.54.-","Indique si en la institución registral de la entidad federativa se realizó la cancelación de asientos o inscripciones registrales durante el año 2022.",null,null,null,null,null,null,null,null,null,null,null,null,null,null,null,null,null,null,null,null,null,null,null,null,null,null,null,null,null,null,null,null,{"$f":"IF(COUNTBLANK(C1327)+COUNTBLANK(I1327)+COUNTBLANK(T1327)=3,1,0)","v":1}]
[null,null,"Seleccione con \"X\" un solo código."]
[]
[null,null,null,"1. Sí",null,null,null,null,null,"2. No (pase a la pregunta 2.58)",null,null,null,null,null,null,null,null,null,null,"9. No se sabe (pase a la pregunta 2.58)"]
[]
[null,null,"En caso de tener algún comentario u observación al dato registrado en la respuesta de la presente pregunta, o de los datos que derivan de la misma, favor de anotarlo en el siguiente espacio. De lo contrario, déjelo en blanco."]
[]
[]
[]
[]
[]
[]
[]
["2.55.-","Seleccione los medios por los cuales se inició la cancelación de asientos o inscripciones registrales durante el año 2022.",null,null,null,null,null,null,null,null,null,null,null,null,null,null,null,null,null,null,null,null,null,null,null,null,null,null,null,null,null,null,null,null,{"$f":"IF(UPPER(C1327)=\"X\",IF(COUNTBLANK(C1342:C1348)=7,1,0), 0)","v":0}]
[null,null,"Puede seleccionar con \"X\" más de un código."]
[null,null,"Si marca el numeral 6, anote el otro medio en el recuadro que está al final de la lista."]
[null,null,"Si elige el numeral 9, no marque otro código."]
[]
[null,null,null,"1. Por consentimiento de las personas a cuyo favor estén hechas, mediante escritura pública"]
[null,null,null,"2. A petición de parte, por extinción del acto o derecho inscrito"]
[null,null,null,"3. Por orden judicial o administrativa"]
[null,null,null,"4. Por cumplimiento del plazo o el fallecimiento del titular, tratándose de derechos temporales o vitalicios"]
[null,null,null,"5. Por caducidad"]
[null,null,null,"6. Otro (especifique)"]
[null,null,null,"9. No se sabe"]
[]
[null,null,"Otro medio:\n(especifique)",null,null,null,null,null,null,null,null,null,null,null,null,null,null,null,null,null,null,null,null,null,null,null,null,null,null,null,null,null,null,null,{"$f":"IF(UPPER(C1347=\"X\"),COUNTBLANK(G1350),0)","v":0}]
[]
[null,null,"En caso de tener algún comentario u observación al dato registrado en la respuesta de la presente pregunta, o de los datos que derivan de la misma, favor de anotarlo en el siguiente espacio. De lo contrario, déjelo en blanco."]
[]
[]
[]
[]
[]
[]
[]
["2.56.-","Seleccione los tipos de cancelaciones que se realizaron en la institución registral de la entidad federativa durante el año 2022.",null,null,null,null,null,null,null,null,null,null,null,null,null,null,null,null,null,null,null,null,null,null,null,null,null,null,null,null,null,null,null,null,{"$f":"IF(UPPER(C1327)=\"X\",IF(COUNTBLANK(C1364:C1366)=3,1,0), 0)","v":0}]
[null,null,"Puede seleccionar con \"X\" más de un código."]
[null,null,"Si elige el numeral 9, no marque otro código."]
[]
[null,null,null,"1. Parcial"]
[null,null,null,"2. Total"]
[null,null,null,"9. No se sabe"]
[]
[null,null,"En caso de tener algún comentario u observación al dato registrado en la respuesta de la presente pregunta, o de los datos que derivan de la misma, favor de anotarlo en el siguiente espacio. De lo contrario, déjelo en blanco."]
[]
[]
[]
[]
[]
[]
[]
["2.57.-","Indique si durante el año 2022 se suspendieron los trámites en proceso sobre los asientos o inscripciones registrales hasta que se concluyó la cancelación.",null,null,null,null,null,null,null,null,null,null,null,null,null,null,null,null,null,null,null,null,null,null,null,null,null,null,null,null,null,null,null,null,{"$f":"IF(UPPER(C1327)=\"X\",IF(COUNTBLANK(C1379)+COUNTBLANK(I1379)+COUNTBLANK(T1379)=3,1,0),0)","v":0}]
[null,null,"Seleccione con \"X\" un solo código."]
[]
[null,null,null,"1. Sí",null,null,null,null,null,"2. No",null,null,null,null,null,null,null,null,null,null,"9. No se sabe"]
[]
[null,null,"En caso de tener algún comentario u observación al dato registrado en la respuesta de la presente pregunta, o de los datos que derivan de la misma, favor de anotarlo en el siguiente espacio. De lo contrario, déjelo en blanco."]
[]
[]
[]
[]
[]
[]
[null,null,null,null,null,null,null,null,null,null,null,null,null,null,null,null,null,null,null,null,null,null,null,null,null,null,null,null,null,null,null,null,null,null,{"$f":"IF(SUM(AI896,AI943,AI957,AI929,AI915,AI974,AI988,AI1002,AI1019,AI1078,AI1088,AI1101,AI1120,AI1130,AI1165,AI1175,AI1188,AI1199,AI1209,AI1220,AI1230,AI1243,AI1256,AI1269,AI1280,AI1290,AI1301,AI1311,AI1324,AI1337,AI1350,AI1360,AI1376)=0,0,1)","v":1}]
[null,"II.5 Conservación y consulta del acervo documental"]
[]
["2.58.-","Indique si la institución registral de la entidad federativa realizó actividades para la conservación del acervo documental durante el año 2022."]
[null,null,"Seleccione con \"X\" un solo código."]
[]
[null,null,null,"1. Sí",null,null,null,null,null,"2. No (pase a la pregunta 2.63)",null,null,null,null,null,null,null,null,null,null,"9. No se sabe (pase a la pregunta 2.63)",null,null,null,null,null,null,null,null,null,null,null,null,null,{"$f":"IF(COUNTBLANK(C1394)+COUNTBLANK(I1394)+COUNTBLANK(T1394)=3,1,0)","v":1}]
[]
[null,null,"En caso de tener algún comentario u observación al dato registrado en la respuesta de la presente pregunta, o de los datos que derivan de la misma, favor de anotarlo en el siguiente espacio. De lo contrario, déjelo en blanco."]
[null,null,null,null,null,null,null,null,null,null,null,null,null,null,null,null,null,null,null,null,null,null,null,null,null,null,null,null,null,null,null,null,null,null,null,{"$f":"IF(AK1397=1,COUNTBLANK(C1397),0)","v":0},0]
[]
[]
[]
[]
[]
[]
["2.59.-","Seleccione los procedimientos que fueron utilizados para la conservación del acervo documental durante el año 2022.",null,null,null,null,null,null,null,null,null,null,null,null,null,null,null,null,null,null,null,null,null,null,null,null,null,null,null,null,null,null,null,null,{"$f":"IF(UPPER(C1394)=\"X\",IF(COUNTBLANK(C1410:C1417)=8,1,0), 0)","v":0}]
[null,null,"Puede seleccionar con \"X\" más de un código.",null,null,null,null,null,null,null,null,null,null,null,null,null,null,null,null,null,null,null,null,null,null,null,null,null,null,null,null,null,null,null,{"$f":"IF(UPPER(C1410=\"X\"),COUNTBLANK(P1410),0)","v":0}]
[null,null,"Si selecciona el numeral \"1. Digitalización de archivos\", anote el porcentaje de archivos digitalizados al cierre del año 2022 en la institución registral de la entidad federativa. La cifra debe estar escrita con números enteros sin el símbolo de porcentaje (%)."]
[null,null,"Si marca el numeral 7, anote el otro procedimiento en el recuadro que está al final de la lista."]
[null,null,"Si elige el numeral 9, no marque otro código."]
[]
[null,null,null,"1. Digitalización de archivos",null,null,null,null,null,null,null,null,null,null,null,null,null,"%"]
[null,null,null,"2. Captura de libros y legajos"]
[null,null,null,"3. Indexación"]
[null,null,null,"4. Verificación del tracto registral"]
[null,null,null,"5. Conversión y migración de la información registral"]
[null,null,null,"6. Restauración de libros"]
[null,null,null,"7. Otro (especifique)"]
[null,null,null,"9. No se sabe"]
[]
[null,null,"Otro procedimiento:\n(especifique)",null,null,null,null,null,null,null,null,null,null,null,null,null,null,null,null,null,null,null,null,null,null,null,null,null,null,null,null,null,null,null,{"$f":"IF(UPPER(C1416=\"X\"),COUNTBLANK(G1419),0)","v":0}]
[]
[null,null,"En caso de tener algún comentario u observación al dato registrado en la respuesta de la presente pregunta, o de los datos que derivan de la misma, favor de anotarlo en el siguiente espacio. De lo contrario, déjelo en blanco."]
[null,null,null,null,null,null,null,null,null,null,null,null,null,null,null,null,null,null,null,null,null,null,null,null,null,null,null,null,null,null,null,null,null,null,null,{"$f":"IF(AK1422=1,COUNTBLANK(C1422),0)","v":0},0]
[]
[]
[]
[]
[]
[]
["2.60.-","Indique si la institución registral de la entidad federativa tuvo un espacio físico acondicionado para la conservación del acervo documental durante el año 2022.",null,null,null,null,null,null,null,null,null,null,null,null,null,null,null,null,null,null,null,null,null,null,null,null,null,null,null,null,null,null,null,null,{"$f":"IF(UPPER(C1394)=\"X\",IF(COUNTBLANK(C1432)+COUNTBLANK(I1432)+COUNTBLANK(T1432)=3,1,0),0)","v":0}]
[null,null,"Seleccione con \"X\" un solo código."]
[]
[null,null,null,"1. Sí",null,null,null,null,null,"2. No ",null,null,null,null,null,null,null,null,null,null,"9. No se sabe "]
[]
[null,null,"En caso de tener algún comentario u observación al dato registrado en la respuesta de la presente pregunta, o de los datos que derivan de la misma, favor de anotarlo en el siguiente espacio. De lo contrario, déjelo en blanco."]
[]
[]
[]
[]
[]
[]
[]
["2.61.-","Seleccione las medidas de seguridad que existieron para el resguardo del acervo documental en la oficina estatal o central durante el año 2022. ",null,null,null,null,null,null,null,null,null,null,null,null,null,null,null,null,null,null,null,null,null,null,null,null,null,null,null,null,null,null,null,null,{"$f":"IF(UPPER(C1394)=\"X\",IF(COUNTBLANK(C1447:C1454)=8,1,0), 0)","v":0}]
[null,null,"Puede seleccionar con \"X\" más de un código."]
[null,null,"Si marca el numeral 6, anote la otra medida de seguridad en el recuadro que está al final de la lista."]
[null,null,"Si elige el numeral 7 o el 9, no marque otro código."]
[]
[null,"",null,"1. Área cerrada"]
[null,null,null,"2. Cámaras de seguridad"]
[null,null,null,"3. Códigos de acceso"]
[null,null,null,"4. Registro de préstamo de libros y/o legajos (en papel)"]
[null,"",null,"5. Personal encargado"]
[null,null,null,"6. Otra (especifique)"]
[null,null,null,"7. No existían medidas de seguridad para el resguardo del acervo"]
[null,"",null,"9. No se sabe"]
[]
[null,null,"Otra medida de seguridad:\n(especifique)",null,null,null,null,null,null,null,null,null,null,null,null,null,null,null,null,null,null,null,null,null,null,null,null,null,null,null,null,null,null,null,{"$f":"IF(UPPER(C1452=\"X\"),COUNTBLANK(G1456),0)","v":0}]
[]
[null,null,"En caso de tener algún comentario u observación al dato registrado en la respuesta de la presente pregunta, o de los datos que derivan de la misma, favor de anotarlo en el siguiente espacio. De lo contrario, déjelo en blanco."]
[]
[]
[]
[]
[]
[]
[]
["2.62.-","Seleccione los riesgos para los cuales se establecieron medidas preventivas para el resguardo del acervo en la oficina estatal o central durante el año 2022.",null,null,null,null,null,null,null,null,null,null,null,null,null,null,null,null,null,null,null,null,null,null,null,null,null,null,null,null,null,null,null,null,{"$f":"IF(UPPER(C1394)=\"X\",IF(COUNTBLANK(C1471:C1477)=7,1,0), 0)","v":0}]
[null,null,"Puede seleccionar con \"X\" más de un código."]
[null,null,"Si marca el numeral 5, anote el otro tipo de riesgo para el que se establecieron medidas preventivas en el recuadro que está al final de la lista."]
[null,null,"Si elige el numeral 6 o el 9, no marque otro código."]
[]
[null,null,null,"1. Incendio"]
[null,null,null,"2. Humedad"]
[null,null,null,"3. Plagas"]
[null,null,null,"4. Deterioro"]
[null,null,null,"5. Otro (especifique)"]
[null,null,null,"6. Ninguno"]
[null,null,null,"9. No se sabe"]
[]
[null,null,"Otro tipo de riesgo:\n(especifique)",null,null,null,null,null,null,null,null,null,null,null,null,null,null,null,null,null,null,null,null,null,null,null,null,null,null,null,null,null,null,null,{"$f":"IF(UPPER(C1475=\"X\"),COUNTBLANK(G1479),0)","v":0}]
[]
[null,null,"En caso de tener algún comentario u observación al dato registrado en la respuesta de la presente pregunta, o de los datos que derivan de la misma, favor de anotarlo en el siguiente espacio. De lo contrario, déjelo en blanco."]
[]
[]
[]
[]
[]
[]
[]
["2.63.-","Indique si durante el año 2022 el público pudo consultar la información existente en la institución registral de la entidad federativa.",null,null,null,null,null,null,null,null,null,null,null,null,null,null,null,null,null,null,null,null,null,null,null,null,null,null,null,null,null,null,null,null,{"$f":"IF(COUNTBLANK(C1493)+COUNTBLANK(I1493)+COUNTBLANK(T1493)=3,1,0)","v":1}]
[null,null,"Seleccione con \"X\" un solo código."]
[null,null,"Por información existente, debe entenderse a los asientos, inscripciones, libros, legajos, folios reales físicos o electrónicos, y en general, todos aquellos elementos que conforman el acervo documental de la institución registral."]
[]
[null,null,null,"1. Sí",null,null,null,null,null,"2. No (pase a la pregunta 2.65)",null,null,null,null,null,null,null,null,null,null,"9. No se sabe (pase a la pregunta 2.65)"]
[]
[null,null,"En caso de tener algún comentario u observación al dato registrado en la respuesta de la presente pregunta, o de los datos que derivan de la misma, favor de anotarlo en el siguiente espacio. De lo contrario, déjelo en blanco."]
[null,null,null,null,null,null,null,null,null,null,null,null,null,null,null,null,null,null,null,null,null,null,null,null,null,null,null,null,null,null,null,null,null,null,null,{"$f":"IF(AK1496=1,COUNTBLANK(C1496),0)","v":0},0]
[]
[]
[]
[]
[]
[]
["2.64.-","Seleccione los métodos por los que el público pudo consultar la información existente en la institución registral durante el año 2022.",null,null,null,null,null,null,null,null,null,null,null,null,null,null,null,null,null,null,null,null,null,null,null,null,null,null,null,null,null,null,null,null,{"$f":"IF(UPPER(C1493)=\"X\",IF(COUNTBLANK(C1507:C1510)=4,1,0), 0)","v":0}]
[null,null,"Puede seleccionar con \"X\" más de un código."]
[null,null,"Si marca el numeral 4, anote el otro método de consulta en el recuadro que está al final de la lista."]
[]
[null,null,null,"1. En forma física"]
[null,null,null,"2. En forma digital en las oficinas de la institución registral"]
[null,null,null,"3. En forma digital en la página de Internet de la institución registral"]
[null,null,null,"4. Otro (especifique)"]
[]
[null,null,"Otro método de consulta:\n(especifique)",null,null,null,null,null,null,null,null,null,null,null,null,null,null,null,null,null,null,null,null,null,null,null,null,null,null,null,null,null,null,null,{"$f":"IF(UPPER(C1510=\"X\"),COUNTBLANK(G1512),0)","v":0}]
[]
[null,null,"En caso de tener algún comentario u observación al dato registrado en la respuesta de la presente pregunta, o de los datos que derivan de la misma, favor de anotarlo en el siguiente espacio. De lo contrario, déjelo en blanco."]
[]
[]
[]
[]
[]
[]
[null,null,null,null,null,null,null,null,null,null,null,null,null,null,null,null,null,null,null,null,null,null,null,null,null,null,null,null,null,null,null,null,null,null,{"$f":"IF(SUM(AI1394,AI1404,AI1405,AI1419,AI1429,AI1442,AI1456,AI1466,AI1479,AI1489,AI1503,AI1512)=0,0,1)","v":1}]
[null,"II.6 Tecnologías de la información"]
[null,"Glosario de la subsección:"]
[null,null,"1.- Grandes usuarios: se refiere a aquellos que realizan trámites registrales de forma masiva, tales como notarios, INFONAVIT, FOVISSSTE, SHF, entre otros."]
[null,null,"2.- Otras instituciones: se refiere a aquellas que tienen relación con la actividad registral, tales como catastro, RAN, INDAABIN, entre otros."]
[null,null,"3.- Indicadores de operación: se refiere a aquellos que se generan para conocer las operaciones que realizan las instituciones registrales en su gestión."]
[null,null,"4.- Indicadores de servicios: se refiere a aquellos que se generan para medir la calidad en el servicio, por lo que reflejan la eficiencia y calidad de los servicios que se prestan en la institución registral."]
[]
["2.65.-","Indique si la institución registral de la entidad federativa tuvo un sistema de gestión registral durante el año 2022.",null,null,null,null,null,null,null,null,null,null,null,null,null,null,null,null,null,null,null,null,null,null,null,null,null,null,null,null,null,null,null,null,{"$f":"IF(COUNTBLANK(C1532)+COUNTBLANK(I1532)+COUNTBLANK(T1532)=3,1,0)","v":1}]
[null,null,"Seleccione con \"X\" un solo código."]
[]
[null,null,null,"1. Sí",null,null,null,null,null,"2. No (pase a la pregunta 2.68)",null,null,null,null,null,null,null,null,null,null,"9. No se sabe (pase a la pregunta 2.68)"]
[]
[null,null,"En caso de tener algún comentario u observación al dato registrado en la respuesta de la presente pregunta, o de los datos que derivan de la misma, favor de anotarlo en el siguiente espacio. De lo contrario, déjelo en blanco."]
[null,null,null,null,null,null,null,null,null,null,null,null,null,null,null,null,null,null,null,null,null,null,null,null,null,null,null,null,null,null,null,null,null,null,null,{"$f":"IF(AK1535=1,COUNTBLANK(C1535),0)","v":0},0]
[]
[]
[]
[]
[]
[]
["2.66.-","Seleccione los elementos incorporados en el sistema de gestión registral empleado por la institución registral de la entidad federativa durante el año 2022.",null,null,null,null,null,null,null,null,null,null,null,null,null,null,null,null,null,null,null,null,null,null,null,null,null,null,null,null,null,null,null,null,{"$f":"IF(UPPER(C1532)=\"X\",IF(COUNTBLANK(C1547:C1557)=11,1,0), 0)","v":0}]
[null,null,"Puede seleccionar con \"X\" más de un código."]
[null,null,"Si marca el numeral 10, anote el otro elemento en el recuadro que está al final de la lista."]
[null,null,"Si elige el numeral 99, no marque otro código."]
[]
[null,null,null,"1. Proceso de inscripción "]
[null,null,null,"2. Proceso de conservación del acervo"]
[null,null,null,"3. Proceso de certificación"]
[null,null,null,"4. Proceso de consulta "]
[null,null,null,"5. Validación de pagos"]
[null,null,null,"6. Firma electrónica"]
[null,null,null,"7. Interfaces con grandes usuarios "]
[null,null,null,"8. Interfaces con otras instituciones "]
[null,null,null,"9. Interfaz para el público en general"]
[null,null,null,"10. Otro (especifique)"]
[null,null,null,"99. No se sabe"]
[]
[null,null,"Otro elemento:\n(especifique)",null,null,null,null,null,null,null,null,null,null,null,null,null,null,null,null,null,null,null,null,null,null,null,null,null,null,null,null,null,null,null,{"$f":"IF(UPPER(C1556=\"X\"),COUNTBLANK(G1559),0)","v":0}]
[]
[null,null,"En caso de tener algún comentario u observación al dato registrado en la respuesta de la presente pregunta, o de los datos que derivan de la misma, favor de anotarlo en el siguiente espacio. De lo contrario, déjelo en blanco."]
[]
[]
[]
[]
[]
[]
[]
["2.67.-","Seleccione las instancias que desarrollaron el sistema de gestión registral que usó la institución registral durante el año 2022.",null,null,null,null,null,null,null,null,null,null,null,null,null,null,null,null,null,null,null,null,null,null,null,null,null,null,null,null,null,null,null,null,{"$f":"IF(UPPER(C1532)=\"X\",IF(COUNTBLANK(C1574:C1580)=9,1,0), 0)","v":0}]
[null,null,"Puede seleccionar con \"X\" más de un código."]
[null,null,"Si marca el numeral 6, anote la otra instancia en el recuadro que está al final de la lista."]
[null,null,"Si elige el numeral 9, no marque otro código."]
[]
[null,"",null,"1. Administración Pública Federal (SIGER)"]
[null,null,null,"2. Instituciones de la administración pública estatal"]
[null,null,null,"3. Área de informática de la administración pública estatal"]
[null,"",null,"4. Área de informática de la propia institución registral"]
[null,null,null,"5. Empresas particulares"]
[null,"",null,"6. Otra (especifique)"]
[null,null,null,"9. No se sabe",null,null,null,null,null,"","",null,"","",null,"","","",null,null,"","","","","",null,"",""]
[]
[null,null,"Otra instancia:\n(especifique)",null,null,null,null,null,null,null,null,null,null,null,null,null,null,null,null,null,null,null,null,null,null,null,null,null,null,null,null,null,null,null,{"$f":"IF(UPPER(C1579=\"X\"),COUNTBLANK(G1582),0)","v":0}]
[]
[null,null,"En caso de tener algún comentario u observación al dato registrado en la respuesta de la presente pregunta, o de los datos que derivan de la misma, favor de anotarlo en el siguiente espacio. De lo contrario, déjelo en blanco."]
[]
[]
[]
[]
[]
[]
[]
["2.68.-","Indique si durante el año 2022 la institución registral generó estadísticas de operación.",null,null,null,null,null,null,null,null,null,null,null,null,null,null,null,null,null,null,null,null,null,null,null,null,null,null,null,null,null,null,null,null,{"$f":"IF(COUNTBLANK(C1595)+COUNTBLANK(I1595)+COUNTBLANK(T1595)=3,1,0)","v":1}]
[null,null,"Seleccione con \"X\" un solo código."]
[]
[null,null,null,"1. Sí",null,null,null,null,null,"2. No (pase a la pregunta 2.70)",null,null,null,null,null,null,null,null,null,null,"9. No se sabe (pase a la pregunta 2.70)"]
[]
[null,null,"En caso de tener algún comentario u observación al dato registrado en la respuesta de la presente pregunta, o de los datos que derivan de la misma, favor de anotarlo en el siguiente espacio. De lo contrario, déjelo en blanco."]
[]
[]
[]
[]
[]
[]
[]
["2.69.-","Indique si durante el año 2022 la institución registral generó los siguientes tipos de reportes estadísticos de operación.",null,null,null,null,null,null,null,null,null,null,null,null,null,null,null,null,null,null,null,null,null,null,null,null,null,null,null,null,null,null,null,null,{"$f":"IF(UPPER(C1595)=\"X\",IF(AND(U1609=1,OR(U1610=\"\",U1611=\"\")),1,0)+IF(AND(U1612=1,OR(U1613=\"\",U1614=\"\",U1615=\"\",U1616=\"\",U1617=\"\")),1,0)+IF(AND(U1619=1,OR(U1620=\"\",U1621=\"\",U1622=\"\",U1623=\"\")),1,0)+IF(AND(U1625=1,OR(U1626=\"\",U1627=\"\")),1,0)+COUNTBLANK(U1609)+COUNTBLANK(U1612)+COUNTBLANK(U1618)+COUNTBLANK(U1619)+COUNTBLANK(U1624)+COUNTBLANK(U1625)+COUNTBLANK(U1628),0)","v":0}]
[null,null,"Si responde \"1. Sí\" en el numeral 7, anote el otro tipo de reporte estadístico en el recuadro que está al final de la tabla."]
[]
[null,null,"Tipo de reporte",null,null,null,null,null,null,null,null,null,null,null,null,null,null,null,null,null,"¿Se generó este reporte?\n(1.Sí / 2.No / 9.No se sabe)"]
[null,null,"1.","Solicitudes nuevas"]
[null,null,"1.1",null,"Ingresadas por ventanilla física"]
[null,null,"1.2",null,"Ingresadas por ventanilla en línea"]
[null,null,"2.","Solicitudes resueltas"]
[null,null,"2.1",null,"Finalizadas"]
[null,null,"2.2",null,"Suspendidas"]
[null,null,"2.3",null,"Negadas"]
[null,null,"2.4",null,"Promedio de días por trámite"]
[null,null,"2.5",null,"Productividad"]
[null,null,"3.","Solicitudes pendientes"]
[null,null,"4.","Por cantidad de trámites"]
[null,null,"4.1",null,"Certificados"]
[null,null,"4.2",null,"Copias simples"]
[null,null,"4.3",null,"Copias certificadas"]
[null,null,"4.4",null,"Inscripciones"]
[null,null,"5.","Rectificaciones"]
[null,null,"6.","Operación"]
[null,null,"6.1",null,"Promedio, en días, para registrar una operación"]
[null,null,"6.2",null,"Días que tarda la expedición de certificados"]
[null,null,"7.","Otro (especifique)"]
[]
[null,null,"Otro tipo de reporte estadístico:\n(especifique)",null,null,null,null,null,null,null,null,null,null,null,null,null,null,null,null,null,null,null,null,null,null,null,null,null,null,null,null,null,null,null,{"$f":"IF(U1628=1,COUNTBLANK(G1630),0)","v":0}]
[]
[null,null,"En caso de tener algún comentario u observación al dato registrado en la respuesta de la presente pregunta, o de los datos que derivan de la misma, favor de anotarlo en el siguiente espacio. De lo contrario, déjelo en blanco."]
[]
[]
[]
[]
[]
[]
[]
["2.70.-","Indique si la institución registral de la entidad federativa tuvo una página de Internet durante el año 2022.",null,null,null,null,null,null,null,null,null,null,null,null,null,null,null,null,null,null,null,null,null,null,null,null,null,null,null,null,null,null,null,null,{"$f":"IF(COUNTBLANK(C1643)+COUNTBLANK(I1643)+COUNTBLANK(T1643)=3,1,0)","v":1}]
[null,null,"Seleccione con \"X\" un solo código."]
[]
[null,null,null,"1. Sí",null,null,null,null,null,"2. No (pase a la pregunta 2.74)",null,null,null,null,null,null,null,null,null,null,"9. No se sabe (pase a la pregunta 2.74)"]
[]
[null,null,"En caso de tener algún comentario u observación al dato registrado en la respuesta de la presente pregunta, o de los datos que derivan de la misma, favor de anotarlo en el siguiente espacio. De lo contrario, déjelo en blanco."]
[]
[]
[]
[]
[]
[]
[]
["2.71.-","Seleccione las acciones que los usuarios pudieron realizar a través de la página de Internet de la institución registral de la entidad federativa durante el año 2022.",null,null,null,null,null,null,null,null,null,null,null,null,null,null,null,null,null,null,null,null,null,null,null,null,null,null,null,null,null,null,null,null,{"$f":"IF(UPPER(C1643)=\"X\",IF(COUNTBLANK(C1658:C1666)=9,1,0), 0)","v":0}]
[null,null,"Puede seleccionar con \"X\" más de un código."]
[null,null,"Si marca el numeral 8, anote el otro tipo de acción en el recuadro que está al final de la lista."]
[null,null,"Si elige el numeral 9, no marque otro código."]
[]
[null,null,null,"1. Consulta de antecedentes registrales"]
[null,null,null,"2. Consulta de estatus del trámite"]
[null,null,null,"3. Consulta de requisitos de trámites y servicios"]
[null,null,null,"4. Consulta de folio real electrónico "]
[null,null,null,"5. Consulta de información de la institución registral"]
[null,null,null,"6. Realizar trámites de inscripción, gravámenes, certificados, copias certificadas, anotaciones preventivas y/o marginales"]
[null,null,null,"7. Solicitud de citas "]
[null,null,null,"8. Otro (especifique)"]
[null,null,null,"9. No se sabe"]
[]
[null,null,"Otro tipo de acción:\n(especifique)",null,null,null,null,null,null,null,null,null,null,null,null,null,null,null,null,null,null,null,null,null,null,null,null,null,null,null,null,null,null,null,{"$f":"IF(UPPER(C1665=\"X\"),COUNTBLANK(G1668),0)","v":0}]
[]
[null,null,"En caso de tener algún comentario u observación al dato registrado en la respuesta de la presente pregunta, o de los datos que derivan de la misma, favor de anotarlo en el siguiente espacio. De lo contrario, déjelo en blanco."]
[]
[]
[]
[]
[]
[]
[]
["2.72.-","Indique si los siguientes tipos de portales existieron en la página de Internet de la institución registral de la entidad federativa durante el año 2022. ",null,null,null,null,null,null,null,null,null,null,null,null,null,null,null,null,null,null,null,null,null,null,null,null,null,null,null,null,null,null,null,null,{"$f":"IF(UPPER(C1643)=\"X\",(IF(COUNTBLANK(Z1682:Z1686)>0,1,0)),0)","v":0}]
[null,null,"Si responde \"1. Sí\" en el numeral 5, anote el otro tipo de portal en el recuadro que está al final de la tabla."]
[]
[null,null,"Tipo de portal ",null,null,null,null,null,null,null,null,null,null,null,null,null,null,null,null,null,null,null,null,null,null,"¿Existió?\n(1.Sí / 2.No / 9.No se sabe)"]
[null,null,"1.","Portal de servicios a grandes usuarios"]
[null,null,"2.","Portal de servicios a otras instituciones "]
[null,null,"3.","Portal de servicios al público en general"]
[null,null,"4.","Intranet de la institución registral"]
[null,null,"5.","Otro (especifique)"]
[]
[null,null,"Otro tipo de portal:\n(especifique)",null,null,null,null,null,null,null,null,null,null,null,null,null,null,null,null,null,null,null,null,null,null,null,null,null,null,null,null,null,null,null,{"$f":"IF(Z1686=1,COUNTBLANK(G1688),0)","v":0}]
[]
[null,null,"En caso de tener algún comentario u observación al dato registrado en la respuesta de la presente pregunta, o de los datos que derivan de la misma, favor de anotarlo en el siguiente espacio. De lo contrario, déjelo en blanco."]
[]
[]
[]
[]
[]
[]
[]
["2.73.-","Si registró una respuesta afirmativa en el numeral \"1. Portal de servicios a grandes usuarios\" de la pregunta 2.72, seleccione las funciones que contuvo dicho portal durante el año 2022. ",null,null,null,null,null,null,null,null,null,null,null,null,null,null,null,null,null,null,null,null,null,null,null,null,null,null,null,null,null,null,null,null,{"$f":"IF(AND(UPPER(C1643)=\"X\",Z1682=1),IF(COUNTBLANK(C1703:C1712)=10,1,0), 0)","v":0}]
[null,null,"Puede seleccionar con \"X\" más de un código."]
[null,null,"Si marca el numeral 9, anote la otra función en el recuadro que está al final de la lista."]
[null,null,"Si elige el numeral 99, no marque otro código."]
[]
[null,null,null,"1. Servicios electrónicos de consulta"]
[null,null,null,"2. Consulta de estatus del trámite"]
[null,null,null,"3. Consulta de estatus del folio real electrónico"]
[null,null,null,"4. Trámites y servicios electrónicos"]
[null,null,null,"5. Recepción y precaptura de actos inmobiliarios"]
[null,null,null,"6. Motor de cálculo de derechos e impuestos relativos a la propiedad"]
[null,null,null,"7. Módulo de pago y/o facturación"]
[null,null,null,"8. Cancelaciones"]
[null,null,null,"9. Otra (especifique)"]
[null,null,null,"99. No se sabe"]
[]
[null,null,"Otra función:\n(especifique)",null,null,null,null,null,null,null,null,null,null,null,null,null,null,null,null,null,null,null,null,null,null,null,null,null,null,null,null,null,null,null,{"$f":"IF(UPPER(C1711=\"X\"),COUNTBLANK(G1714),0)","v":0}]
[]
[null,null,"En caso de tener algún comentario u observación al dato registrado en la respuesta de la presente pregunta, o de los datos que derivan de la misma, favor de anotarlo en el siguiente espacio. De lo contrario, déjelo en blanco."]
[]
[]
[]
[]
[]
[]
[]
["2.74.-","Indique si la institución registral de la entidad federativa brindó servicios electrónicos al público en general durante el año 2022.",null,null,null,null,null,null,null,null,null,null,null,null,null,null,null,null,null,null,null,null,null,null,null,null,null,null,null,null,null,null,null,null,{"$f":"IF(COUNTBLANK(C1727)+COUNTBLANK(I1727)+COUNTBLANK(T1727)=3,1,0)","v":1}]
[null,null,"Seleccione con \"X\" un solo código."]
[]
[null,null,null,"1. Sí",null,null,null,null,null,"2. No (pase a la pregunta 2.76)",null,null,null,null,null,null,null,null,null,null,"9. No se sabe (pase a la pregunta 2.76)"]
[]
[null,null,"En caso de tener algún comentario u observación al dato registrado en la respuesta de la presente pregunta, o de los datos que derivan de la misma, favor de anotarlo en el siguiente espacio. De lo contrario, déjelo en blanco."]
[]
[]
[]
[]
[]
[]
[]
["2.75.-","Indique si durante el año 2022 la institución registral de la entidad federativa brindó los siguientes servicios electrónicos en las oficinas, la página de Internet y/o en módulos de autoservicio.",null,null,null,null,null,null,null,null,null,null,null,null,null,null,null,null,null,null,null,null,null,null,null,null,null,null,null,null,null,null,null,null,{"$f":"IF(UPPER(C1727)=\"X\",IF(AND(P1745=1,OR(P1746=\"\",P1747=\"\",P1748=\"\")),1,0)+IF(AND(U1745=1,OR(U1746=\"\",U1747=\"\",U1748=\"\")),1,0)+IF(AND(Z1745=1,OR(Z1746=\"\",Z1747=\"\",Z1748=\"\")),1,0)+COUNTBLANK(Z1742:Z1745)+COUNTBLANK(Z1749)+COUNTBLANK(U1742:U1745)+COUNTBLANK(U1749)+COUNTBLANK(P1742:P1745)+COUNTBLANK(P1749),0)","v":0}]
[null,null,"Si responde \"1. Sí\" en el numeral 5, anote el otro servicio electrónico en el recuadro que está al final de la tabla."]
[]
[null,null,"Servicios electrónicos",null,null,null,null,null,null,null,null,null,null,null,null,"¿Brindó el servicio? \n(1.Sí / 2.No / 9.No se sabe)"]
[null,null,null,null,null,null,null,null,null,null,null,null,null,null,null,"Oficinas de la institución registral",null,null,null,null,"Página de Internet de la institución registral",null,null,null,null,"Módulos de autoservicio"]
[null,null,"1.","Consulta de estatus del trámite"]
[null,null,"2.","Consulta de la información registral"]
[null,null,"3.","Consulta de inscripciones"]
[null,null,"4.","Trámites electrónicos"]
[null,null,"4.1",null,"Anotaciones marginales y/o preventivas"]
[null,null,"4.2",null,"Inscripciones"]
[null,null,"4.3",null,"Certificados"]
[null,null,"5.","Otro (especifique)"]
[]
[null,null,"Otro servicio electrónico:\n(especifique)",null,null,null,null,null,null,null,null,null,null,null,null,null,null,null,null,null,null,null,null,null,null,null,null,null,null,null,null,null,null,null,{"$f":"IF(OR(P1749=1, U1749=1, Z1749=1),COUNTBLANK(G1751),0)","v":0}]
[]
[null,null,"En caso de tener algún comentario u observación al dato registrado en la respuesta de la presente pregunta, o de los datos que derivan de la misma, favor de anotarlo en el siguiente espacio. De lo contrario, déjelo en blanco."]
[]
[]
[]
[]
[]
[]
[]
["2.76.-","Indique si la institución registral de la entidad federativa contó con un centro de atención telefónica durante el año 2022.",null,null,null,null,null,null,null,null,null,null,null,null,null,null,null,null,null,null,null,null,null,null,null,null,null,null,null,null,null,null,null,null,{"$f":"IF(COUNTBLANK(C1764)+COUNTBLANK(I1764)+COUNTBLANK(T1764)=3,1,0)","v":1}]
[null,null,"Seleccione con \"X\" un solo código."]
[]
[null,null,null,"1. Sí",null,null,null,null,null,"2. No",null,null,null,null,null,null,null,null,null,null,"9. No se sabe"]
[]
[null,null,"En caso de tener algún comentario u observación al dato registrado en la respuesta de la presente pregunta, o de los datos que derivan de la misma, favor de anotarlo en el siguiente espacio. De lo contrario, déjelo en blanco."]
[]
[]
[]
[]
[]
[]
[]
["2.77.-","Seleccione los indicadores de servicios que durante el año 2022 existieron en la institución registral de la entidad federativa.",null,null,null,null,null,null,null,null,null,null,null,null,null,null,null,null,null,null,null,null,null,null,null,null,null,null,null,null,null,null,null,null,{"$f":"IF(COUNTBLANK(C1778:C1791)=14,1,0)","v":1}]
[null,null,"Puede seleccionar con \"X\" más de un código. "]
[null,null,"Si elige el numeral 13 o el 99, no marque otro código. "]
[]
[null,null,null,"1. Servicios electrónicos de consulta en oficinas de la institución registral"]
[null,null,null,"2. Servicios electrónicos de consulta registral por Internet"]
[null,null,null,"3. Portal de servicios a grandes usuarios"]
[null,null,null,"4. Tiempo para procesar la inscripción de una hipoteca"]
[null,null,null,"5. Tiempo para procesar una compraventa "]
[null,null,null,"6. Tiempo para expedir certificado de libertad de gravamen "]
[null,null,null,"7. Costos por proceso"]
[null,null,null,"8. Consulta directa de libros "]
[null,null,null,"9. Servicios en ventanilla"]
[null,null,null,"10. Servicios electrónicos en autoservicio"]
[null,null,null,"11. Servicios electrónicos"]
[null,null,null,"12. Productividad"]
[null,null,null,"13. Ninguno"]
[null,null,null,"99. No se sabe"]
[]
[null,null,"En caso de tener algún comentario u observación al dato registrado en la respuesta de la presente pregunta, o de los datos que derivan de la misma, favor de anotarlo en el siguiente espacio. De lo contrario, déjelo en blanco."]
[]
[]
[]
[]
[]
[]
[]
["2.78.-","Seleccione los indicadores de operación que durante el año 2022 existieron en la institución registral de la entidad federativa.",null,null,null,null,null,null,null,null,null,null,null,null,null,null,null,null,null,null,null,null,null,null,null,null,null,null,null,null,null,null,null,null,{"$f":"IF(COUNTBLANK(C1805:C1814)=11,1,0)","v":0}]
[null,null,"Puede seleccionar con \"X\" más de un código. "]
[null,null,"Si elige el numeral 9 o el 99, no marque otro código. "]
[]
[null,null,null,"1. Solicitudes nuevas"]
[null,null,null,"2. Solicitudes resueltas "]
[null,null,null,"3. Solicitudes pendientes "]
[null,null,null,"4. Recursos de inconformidad"]
[null,null,null,"5. Rectificaciones"]
[null,null,null,"6. Información financiera "]
[null,null,null,"7. Costos"]
[null,null,null,"8. Tarifas"]
[null,null,null,"9. Ninguno"]
[null,null,null,"99. No se sabe"]
[]
[null,null,"En caso de tener algún comentario u observación al dato registrado en la respuesta de la presente pregunta, o de los datos que derivan de la misma, favor de anotarlo en el siguiente espacio. De lo contrario, déjelo en blanco."]
[]
[]
[]
[]
[]
[]
[null,null,null,null,null,null,null,null,null,null,null,null,null,null,null,null,null,null,null,null,null,null,null,null,null,null,null,null,null,null,null,null,null,null,{"$f":"IF(SUM(AI1559,AI1542,AI1529,AI1569,AI1582,AI1592,AI1605,AI1630,AI1640,AI1653,AI1668,AI1678,AI1688,AI1698,AI1714,AI1724,AI1737,AI1751,AI1761,AI1774,AI1801)=0,0,1)","v":1}]
[null,"II.7 Vinculación e intercambio de información registral"]
[]
["2.79.-","Indique si al cierre del año 2022 existió vinculación de bienes inmuebles entre la institución registral y el catastro estatal mediante la asociación de un identificador común, ya sea la clave catastral, el folio real electrónico, domicilio u otro elemento. Si la respuesta es afirmativa, anote el porcentaje de vinculación y el total de bienes inmuebles vinculados.",null,null,null,null,null,null,null,null,null,null,null,null,null,null,null,null,null,null,null,null,null,null,null,null,null,null,null,null,null,null,null,null,{"$f":"IF(M1833=1,IF(COUNTBLANK(S1833)+COUNTBLANK(Y1833)>0,1,0),0)+COUNTBLANK(M1833)","v":1}]
[null,null,"Si desconoce alguna cantidad, registre \"NS\" en la celda correspondiente."]
[null,null,"Registre el porcentaje de vinculación con números enteros sin el símbolo %."]
[null,null,"Registre la cantidad de bienes inmuebles vinculados omitiendo duplicados."]
[null,null,"Las cantidades deben registrarse con números enteros y sin comas."]
[]
[null,null,null,null,null,null,null,null,null,null,null,null,"¿Existió vinculación?\n(1.Sí / 2.No / 9.No se sabe)",null,null,null,null,null,"Porcentaje de vinculación",null,null,null,null,null,"Total de bienes inmuebles vinculados"]
[null,null,"1.","Institución registral y catastro estatal"]
[]
[null,null,"En caso de tener algún comentario u observación al dato registrado en la respuesta de la presente pregunta, o de los datos que derivan de la misma, favor de anotarlo en el siguiente espacio. De lo contrario, déjelo en blanco."]
[null,null,null,null,null,null,null,null,null,null,null,null,null,null,null,null,null,null,null,null,null,null,null,null,null,null,null,null,null,null,null,null,null,null,null,{"$f":"IF(AK1836=1,COUNTBLANK(C1836),0)","v":0},0]
[]
[]
[null,null,null,null,null,null,null,null,null,null,null,null,null,null,null,null,null,null,null,null,null,null,null,null,null,null,null,null,null,null,null,null,null,null,null,null,1]
[]
[]
[]
["2.80.-","Indique si la institución registral de la entidad federativa tuvo intercambio de información con usuarios y/o instituciones durante el año 2022.",null,null,null,null,null,null,null,null,null,null,null,null,null,null,null,null,null,null,null,null,null,null,null,null,null,null,null,null,null,null,null,null,{"$f":"IF(COUNTBLANK(C1846)+COUNTBLANK(I1846)+COUNTBLANK(T1846)=3,1,0)","v":1}]
[null,null,"Seleccione con \"X\" un solo código."]
[]
[null,null,null,"1. Sí",null,null,null,null,null,"2. No (pase a la pregunta 2.82)",null,null,null,null,null,null,null,null,null,null,"9. No se sabe (pase a la pregunta 2.82)"]
[]
[null,null,"En caso de tener algún comentario u observación al dato registrado en la respuesta de la presente pregunta, o de los datos que derivan de la misma, favor de anotarlo en el siguiente espacio. De lo contrario, déjelo en blanco."]
[]
[]
[]
[]
[]
[]
[]
["2.81.-","Indique los usuarios y/o instituciones con los que la institución registral de la entidad federativa tuvo intercambio de información, así como los medios utilizados durante el año 2022. ",null,null,null,null,null,null,null,null,null,null,null,null,null,null,null,null,null,null,null,null,null,null,null,null,null,null,null,null,null,null,null,null,{"$f":"IF(UPPER(C1846)=\"X\",IF(P1863=1,IF(COUNTBLANK(V1863:AD1863)=9,1,0),0)+IF(P1864=1,IF(COUNTBLANK(V1864:AD1864)=9,1,0),0)+IF(P1865=1,IF(COUNTBLANK(V1865:AD1865)=9,1,0),0)+IF(P1866=1,IF(COUNTBLANK(V1866:AD1866)=9,1,0),0)+IF(P1867=1,IF(COUNTBLANK(V1867:AD1867)=9,1,0),0)+IF(P1868=1,IF(COUNTBLANK(V1868:AD1868)=9,1,0),0)+IF(P1869=1,IF(COUNTBLANK(V1869:AD1869)=9,1,0),0)+IF(P1870=1,IF(COUNTBLANK(V1870:AD1870)=9,1,0),0)+IF(P1871=1,IF(COUNTBLANK(V1871:AD1871)=9,1,0),0)+IF(P1872=1,IF(COUNTBLANK(V1872:AD1872)=9,1,0),0)+IF(P1873=1,IF(COUNTBLANK(V1873:AD1873)=9,1,0),0)+IF(P1874=1,IF(COUNTBLANK(V1874:AD1874)=9,1,0),0)+IF(P1875=1,IF(COUNTBLANK(V1875:AD1875)=9,1,0),0)+IF(P1876=1,IF(COUNTBLANK(V1876:AD1876)=9,1,0),0)+IF(P1877=1,IF(COUNTBLANK(V1877:AD1877)=9,1,0),0)+IF(P1878=1,IF(COUNTBLANK(V1878:AD1878)=9,1,0),0)+IF(P1879=1,IF(COUNTBLANK(V1879:AD1879)=9,1,0),0)+IF(P1880=1,IF(COUNTBLANK(V1880:AD1880)=9,1,0),0)++COUNTBLANK(P1863:P1880),0)","v":0}]
[null,null,"Puede seleccionar con \"X\" más de un medio de intercambio de información."]
[null,null,"Si selecciona el numeral 9 del catálogo de medios de intercambio de información, no marque otro medio."]
[null,null,"Si responde \"1. Sí\" en el numeral 18, anote el otro usuario o institución en el recuadro que está al final de la tabla."]
[]
[null,null,"Usuarios o instituciones",null,null,null,null,null,null,null,null,null,null,null,null,"¿Existió intercambio de información?\n(1.Sí / 2.No / 9.No se sabe)",null,null,null,null,null,"Medios de intercambio de información\n(ver catálogo)"]
[null,null,null,null,null,null,null,null,null,null,null,null,null,null,null,null,null,null,null,null,null,1,2,3,4,5,6,7,8,9]
[null,null,"1.","FOVISSSTE"]
[null,null,"2.","INDAABIN"]
[null,null,"3.","INFONAVIT"]
[null,null,"4.","INSUS"]
[null,null,"5.","RAN"]
[null,null,"6.","SAT"]
[null,null,"7.","SEDATU"]
[null,null,"8.","SHF"]
[null,null,"9.","UIF"]
[null,null,"10.","Catastro estatal "]
[null,null,"11.","Instituto estatal de vivienda"]
[null,null,"12.","Organismos regularizadores de la tenencia de la tierra estatales"]
[null,null,"13.","Poder judicial estatal y/o federal"]
[null,null,"14.","Procuraduría y/o fiscalía estatal de justicia"]
[null,null,"15.","Secretaría de planeación y finanzas estatal"]
[null,null,"16.","Catastros municipales"]
[null,null,"17.","Notarios"]
[null,null,"18.","Otro (especifique)"]
[]
[null,null,"Otro usuario o institución:\n(especifique)",null,null,null,null,null,null,null,null,null,null,null,null,null,null,null,null,null,null,null,null,null,null,null,null,null,null,null,null,null,null,null,{"$f":"IF(P1880=1,COUNTBLANK(G1882),0)","v":0}]
[]
[null,null,"Catálogo de medios de intercambio de información"]
[null,null,"1.","Correo electrónico",null,null,null,null,null,null,null,"5.","Servicios WMS",null,null,null,null,null,null,null,"9.","No se sabe"]
[null,null,"2.","Teléfono",null,null,null,null,null,null,null,"6.","Interconexión a bases de datos"]
[null,null,"3.","CD",null,null,null,null,null,null,null,"7.","Web"]
[null,null,"4.","USB",null,null,null,null,null,null,null,"8.","Oficio o por medios impresos"]
[]
[null,null,"En caso de tener algún comentario u observación al dato registrado en la respuesta de la presente pregunta, o de los datos que derivan de la misma, favor de anotarlo en el siguiente espacio. De lo contrario, déjelo en blanco."]
[]
[]
[]
[]
[]
[]
[null,null,null,null,null,null,null,null,null,null,null,null,null,null,null,null,null,null,null,null,null,null,null,null,null,null,null,null,null,null,null,null,null,null,{"$f":"IF(SUM(AI1826,AI1843,AI1856,AI1882)=0,0,1)","v":1}]
[null,"II.8 Programa de modernización de los registros públicos de la propiedad y catastros"]
[]
["2.82.-","Indique si la institución registral de la entidad federativa accedió al programa de modernización de los registros públicos de la propiedad y catastros durante el año 2022.",null,null,null,null,null,null,null,null,null,null,null,null,null,null,null,null,null,null,null,null,null,null,null,null,null,null,null,null,null,null,null,null,{"$f":"IF(COUNTBLANK(C1903)+COUNTBLANK(I1903)+COUNTBLANK(T1903)=3,1,0)","v":1}]
[null,null,"Seleccione con \"X\" un solo código."]
[]
[null,null,null,"1. Sí",null,null,null,null,null,"2. No (finalizar cuestionario)",null,null,null,null,null,null,null,null,null,null,"9. No se sabe (finalizar cuestionario)"]
[]
[null,null,"En caso de tener algún comentario u observación al dato registrado en la respuesta de la presente pregunta, o de los datos que derivan de la misma, favor de anotarlo en el siguiente espacio. De lo contrario, déjelo en blanco."]
[null,null,null,null,null,null,null,null,null,null,null,null,null,null,null,null,null,null,null,null,null,null,null,null,null,null,null,null,null,null,null,null,null,null,null,{"$f":"IF(AK1906=1,COUNTBLANK(C1906),0)","v":0},0]
[]
[]
[]
[]
[]
[]
["2.83.-","Registre los porcentajes de avance actual que se obtuvieron durante el año 2022 para cada componente del Modelo Integral del Registro Público de la Propiedad.",null,null,null,null,null,null,null,null,null,null,null,null,null,null,null,null,null,null,null,null,null,null,null,null,null,null,null,null,null,null,null,null,{"$f":"IF(UPPER(C1903)=\"X\",IF(COUNTBLANK(Y1920:Y1930)>0,1,0),0)","v":0}]
[null,null,"Si desconoce cuál es el porcentaje de avance de algún componente, registre \"NS\" en la celda correspondiente."]
[null,null,"Si únicamente conoce la calificación total, anótela en la celda que corresponde y registre \"NS\" en las celdas de porcentaje de avance por componente."]
[null,null,"Si tiene otro componente, registre su porcentaje en la opción 11 y anote su nombre en el recuadro que se encuentra al final de la tabla. Si no tiene otro componente, registre cero."]
[null,null,"Registre el porcentaje con números enteros hasta con dos decimales sin el símbolo %. "]
[]
[null,null,"Componentes del Modelo Integral del Registro Público de la Propiedad ",null,null,null,null,null,null,null,null,null,null,null,null,null,null,null,null,null,null,null,null,null," Porcentaje de avance actual"]
[null,null,"1.","Calificación total"]
[null,null,"2.","Marco jurídico"]
[null,null,"3.","Procesos registrales"]
[null,null,"4.","Tecnologías de la información "]
[null,null,"5.","Gestión de calidad"]
[null,null,"6.","Profesionalización de la función registral"]
[null,null,"7.","Políticas institucionales "]
[null,null,"8.","Gestión y acervo documental"]
[null,null,"9.","Participación y vinculación con otros sectores"]
[null,null,"10.","Indicadores de desempeño"]
[null,null,"11.","Otro (especifique)"]
[]
[null,null,"Otro componente:\n(especifique)",null,null,null,null,null,null,null,null,null,null,null,null,null,null,null,null,null,null,null,null,null,null,null,null,null,null,null,null,null,null,null,{"$f":"IF(Y1930=1,COUNTBLANK(G1932),0)","v":0}]
[]
[null,null,"En caso de tener algún comentario u observación al dato registrado en la respuesta de la presente pregunta, o de los datos que derivan de la misma, favor de anotarlo en el siguiente espacio. De lo contrario, déjelo en blanco."]
[]
[null,null,null,null,null,null,null,null,null,null,null,null,null,null,null,null,null,null,null,null,null,null,null,null,null,null,null,null,null,null,null,null,null,null,{"$f":"IF(SUM(AI1900,AI1913,AI1932)=0,0,1)","v":1}]
[null,null,null,null,null,null,null,null,null,null,null,null,null,null,null,null,null,null,null,null,null,null,null,null,null,null,null,null,null,null,null,null,null,null,{"$f":"IF(AI248=1,B22,IF(AI550=1,B249,IF(AI748=1,B551,IF(AI891=1,B749,IF(AI1388=1,B892,IF(AI1521=1,B1389,IF(AI1823=1,B1522,IF(AI1897=1,B1824,IF(AI1936=1,B1898,0)))))))))","v":"II.1 Estructura de la institución registral"},{"$f":"IF(SUM(AJ120,AJ578,AJ676,AJ840,AJ908,AJ922,AJ936,AJ950,AJ981,AJ995,AJ1397,AJ1422,AJ1496,AJ1535,AJ1836,AJ1906)=0,0,1)","v":0}]

{"sheet":"listas","index":5,"n_rows":2476,"n_cols":15,"rows_kept":2476,"cut":false,"hidden":true,"merged":[]}
["L_ENTIDAD","CVE","MUN",null,"L_SNS","L_X","L_Antigue","L_Escolari",null,"NOM_ENT","CVE_ENT","NOM_MUN","CVE_MUN"]
["Aguascalientes ","01",11,null,1,"X",1,1,null,"Aguascalientes","01","Aguascalientes","001"]
["Baja California","02","7",null,2,null,2,2,null,"Aguascalientes","01","Asientos","002"]
["Baja California Sur","03",5,null,9,null,3,3,null,"Aguascalientes","01","Calvillo","003",null,1]
["Campeche","04","13",null,null,null,4,4,null,"Aguascalientes","01","Cosío","004",null,2]
["Coahuila de Zaragoza","05",38,null,null,null,5,5,null,"Aguascalientes","01","Jesús María","005",null,3]
["Colima","06",10,"L_SINO","L_CARACT",null,6,6,null,"Aguascalientes","01","Pabellón de Arteaga","006",null,4]
["Chiapas","07",124,"Sí",1,null,7,7,null,"Aguascalientes","01","Rincón de Romos","007",null,5]
["Chihuahua","08",67,"No",2,null,8,8,null,"Aguascalientes","01","San José de Gracia","008",null,6]
["Ciudad de México","09",16,null,null,null,9,9,null,"Aguascalientes","01","Tepezalá","009",null,7]
["Durango","10",39,null,null,null,10,null,null,"Aguascalientes","01","El Llano","010",null,8]
["Guanajuato","11",46,null,null,null,11,null,null,"Aguascalientes","01","San Francisco de los Romo","011",null,9]
["Guerrero","12","85",null,null,null,12,null,null,"Baja California","02","Ensenada","001",null,10]
["Hidalgo","13",84,null,null,null,99,null,null,"Baja California","02","Mexicali","002",null,11]
["Jalisco","14",125,null,null,null,null,null,null,"Baja California","02","Tecate","003",null,12]
["México","15",125,null,null,null,null,null,null,"Baja California","02","Tijuana","004",null,99]
["Michoacán de Ocampo","16",113,null,null,null,null,null,null,"Baja California","02","Playas de Rosarito","005"]
["Morelos","17",36,null,null,null,null,null,null,"Baja California","02","San Quintín","006"]
["Nayarit","18",20,null,null,null,null,null,null,"Baja California","02","San Felipe","007"]
["Nuevo León","19",51,null,null,null,null,null,null,"Baja California Sur","03","Comondú","001"]
["Oaxaca","20",570,null,null,null,null,null,null,"Baja California Sur","03","Mulegé","002"]
["Puebla","21",217,null,null,null,null,null,null,"Baja California Sur","03","La Paz","003"]
["Querétaro","22",18,null,null,null,null,null,null,"Baja California Sur","03","Los Cabos","008"]
["Quintana Roo","23",11,null,null,null,null,null,null,"Baja California Sur","03","Loreto","009"]
["San Luis Potosí","24",58,null,null,null,null,null,null,"Campeche","04","Calkiní","001"]
["Sinaloa","25",18,null,null,null,null,null,null,"Campeche","04","Campeche","002"]
["Sonora","26",72,null,null,null,null,null,null,"Campeche","04","Carmen","003"]
["Tabasco","27",17,null,null,null,null,null,null,"Campeche","04","Champotón","004"]
["Tamaulipas","28",43,null,null,null,null,null,null,"Campeche","04","Hecelchakán","005"]
["Tlaxcala","29",60,null,null,null,null,null,null,"Campeche","04","Hopelchén","006"]
["Veracruz de Ignacio de la Llave","30",212,null,null,null,null,null,null,"Campeche","04","Palizada","007"]
["Yucatán","31",106,null,null,null,null,null,null,"Campeche","04","Tenabo","008"]
["Zacatecas","32",58,null,null,null,null,null,null,"Campeche","04","Escárcega","009"]
[null,null,null,null,null,null,null,null,null,"Campeche","04","Calakmul","010"]
[null,null,null,null,null,null,null,null,null,"Campeche","04","Candelaria","011"]
[null,null,null,null,null,null,null,null,null,"Campeche","04","Seybaplaya","012"]
[null,null,null,null,null,null,null,null,null,"Campeche","04","Dzitbalché","013"]
["01","P2",null,"P3",null,null,null,null,null,"Coahuila de Zaragoza","05","Abasolo","001"]
[2,"DIRECCIÓN DEL REGISTRO PÚBLICO DE LA PROPIEDAD Y DE COMERCIO PARA EL ESTADO DE BAJA CALIFORNIA",2,"GOBIERNO DEL ESTADO DE BAJA CALIFORNIA",null,null,null,null,null,"Coahuila de Zaragoza","05","Acuña","002"]
[5,"INSTITUTO REGISTRAL Y CATASTRAL DEL ESTADO DE COAHUILA DE ZARAGOZA",8,"SECRETARIA GENERAL DE GOBIERNO DEL ESTADO DE CHIHUAHUA",null,null,null,null,null,"Coahuila de Zaragoza","05","Allende","003"]
[6,"INSTITUTO PARA EL REGISTRO DEL TERRITORIO DEL ESTADO DE COLIMA",12,"SECRETARÍA GENERAL DE GOBIERNO DEL ESTADO DE GUERRERO",null,null,null,null,null,"Coahuila de Zaragoza","05","Arteaga","004"]
[11,"DIRECCIÓN DE REGISTROS PÚBLICOS DE LA PROPIEDAD DEL ESTADO DE GUANAJUATO",19,"INSTITUTO REGISTRAL Y CATASTRAL DEL ESTADO DE NUEVO LEÓN",null,null,null,null,null,"Coahuila de Zaragoza","05","Candela","005"]
[17,"INSTITUTO DE SERVICIOS REGISTRALES Y CATASTRALES DEL ESTADO DE MORELOS",21,"INSTITUTO REGISTRAL Y CATASTRAL DEL ESTADO DE PUEBLA",null,null,null,null,null,"Coahuila de Zaragoza","05","Castaños","006"]
[19,"REGISTRO PÚBLICO DE LA PROPIEDAD Y DEL COMERCIO DE NUEVO LEÓN",28,"INSTITUTO REGISTRAL Y CATASTRAL DEL ESTADO DE TAMAULIPAS",null,null,null,null,null,"Coahuila de Zaragoza","05","Cuatro Ciénegas","007"]
[20,"INSTITUTO DE LA FUNCION REGISTRAL DEL ESTADO DE OAXACA",31,"INSTITUTO DE SEGURIDAD JURÍDICA PATRIMONIAL DE YUCATÁN",null,null,null,null,null,"Coahuila de Zaragoza","05","Escobedo","008"]
[22,"DIRECCIÓN DEL REGISTRO PÚBLICO DE LA PROPIEDAD DEL ESTADO DE QUERÉTARO","----",{"$f":"IF(A38=\"02\",D39,IF(A38=\"08\",D40,IF(A38=\"12\",D41,IF(A38=\"19\",D42,IF(A38=\"21\",D43,IF(A38=\"28\",D44,IF(A38=\"31\",D45,\"\")))))))","v":""},null,null,null,null,null,"Coahuila de Zaragoza","05","Francisco I. Madero","009"]
[23,"REGISTRO PÚBLICO DE LA PROPIEDAD Y DEL COMERCIO DEL ESTADO DE QUINTANA ROO",null,"CONSEJERIA JURIDICA",null,null,null,null,null,"Coahuila de Zaragoza","05","Frontera","010"]
[24,"INSTITUTO REGISTRAL Y CATASTRAL DEL ESTADO DE SAN LUIS POTOSI",null,"CONSEJERÍA JURÍDICA Y DE SERVICIOS LEGALES",null,null,null,null,null,"Coahuila de Zaragoza","05","General Cepeda","011"]
[26,"INSTITUTO CATASTRAL Y REGISTRAL DEL ESTADO DE SONORA",null,"DIRECCIÓN DE CATASTRO Y REGISTRO PÚBLICO",null,null,null,null,null,"Coahuila de Zaragoza","05","Guerrero","012"]
["---",{"$f":"IF(A38=\"02\",B39,IF(A38=\"05\",B40,IF(A38=\"06\",B41,IF(A38=\"11\",B42,IF(A38=\"17\",B43,IF(A38=\"19\",B44,IF(A38=\"20\",B45,IF(A38=\"22\",B46,IF(A38=\"23\",B47,IF(A38=\"24\",B48,IF(A38=\"26\",B49,\"\")))))))))))","v":""},null,"DIRECCIÓN GENERAL DE CATASTRO Y REGISTRO PÚBLICO DE LA PROPIEDAD Y DEL COMERCIO",null,null,null,null,null,"Coahuila de Zaragoza","05","Hidalgo","013"]
[null,"DEPARTAMENTO DE REGISTRO PÚBLICO",null,"DIRECCIÓN GENERAL DE REGISTROS PÚBLICOS DE LA PROPIEDAD Y NOTARÍAS",null,null,null,null,null,"Coahuila de Zaragoza","05","Jiménez","014"]
[null,"DIRECCIÓN DE NOTARIAS Y REGISTROS PÚBLICOS DE LA PROPIEDAD",null,"INSTITUTO DE SERVICIOS REGISTRALES Y CATASTRALES",null,null,null,null,null,"Coahuila de Zaragoza","05","Juárez","015"]
[null,"DIRECCIÓN DE REGISTRO PÚBLICO DE LA PROPIEDAD",null,"INSTITUTO DE SEGURIDAD JURÍDICA PATRIMONIAL",null,null,null,null,null,"Coahuila de Zaragoza","05","Lamadrid","016"]
[null,"DIRECCIÓN DE REGISTRO PÚBLICO DE LA PROPIEDAD INMUEBLE Y DE COMERCIO",null,"INSTITUTO REGISTRAL Y CATASTRAL",null,null,null,null,null,"Coahuila de Zaragoza","05","Matamoros","017"]
[null,"DIRECCIÓN DEL REGISTRO PÚBLICO DE LA PROPIEDAD Y DEL COMERCIO",null,"INSTITUTO CATASTRAL Y REGISTRAL",null,null,null,null,null,"Coahuila de Zaragoza","05","Monclova","018"]
[null,"DIRECCIÓN DEL REGISTRO PÚBLICO DE LA PROPIEDAD RAÍZ Y DE COMERCIO",null,"SECRETARÍA DE FINANZAS Y ADMINISTRACIÓN",null,null,null,null,null,"Coahuila de Zaragoza","05","Morelos","019"]
[null,"DIRECCIÓN DEL REGISTRO PÚBLICO DE LA PROPIEDAD Y DEL NOTARIADO",null,"SECRETARIA DE GESTIÓN URBANÍSTICA, ORDENAMIENTO TERRITORIAL, REGISTRAL Y CATASTRAL",null,null,null,null,null,"Coahuila de Zaragoza","05","Múzquiz","020"]
[null,"DIRECCIÓN GENERAL DEL REGISTRO PÚBLICO DE LA PROPIEDAD Y DEL COMERCIO",null,"SECRETARÍA DE GOBIERNO",null,null,null,null,null,"Coahuila de Zaragoza","05","Nadadores","021"]
[null,"DIRECCIÓN GENERAL DEL REGISTRO PÚBLICO DE LA PROPIEDAD Y DE INSPECCIÓN Y ARCHIVO GENERAL DE NOTARIAS",null,"SECRETARIA DE HACIENDA",null,null,null,null,null,"Coahuila de Zaragoza","05","Nava","022"]
[null,"INSTITUTO DE LA FUNCIÓN REGISTRAL",null,"SECRETARÍA DE JUSTICIA Y DERECHOS HUMANOS",null,null,null,null,null,"Coahuila de Zaragoza","05","Ocampo","023"]
[null,"INSTITUTO DE LA FUNCIÓN REGISTRAL DEL ESTADO DE MÉXICO",null,"SECRETARIA GENERAL DE GOBIERNO",null,null,null,null,null,"Coahuila de Zaragoza","05","Parras","024"]
[null,"REGISTRO PÚBLICO DE LA PROPIEDAD Y EL COMERCIO",null,"SECRETARIA GENERAL DE GOBIERNO",null,null,null,null,null,"Coahuila de Zaragoza","05","Piedras Negras","025"]
[null,"OTRO",null,"SUBSECRETARÍA DE ENLACE LEGISLATIVO Y ASUNTOS REGISTRALES",null,null,null,null,null,"Coahuila de Zaragoza","05","Progreso","026"]
[null,null,null,"SUBSECRETARIA DE SERVICIOS Y GOBERNANZA POLÍTICA.",null,null,null,null,null,"Coahuila de Zaragoza","05","Ramos Arizpe","027"]
[null,null,null,"OTRO",null,null,null,null,null,"Coahuila de Zaragoza","05","Sabinas","028"]
[null,null,null,null,null,null,null,null,null,"Coahuila de Zaragoza","05","Sacramento","029"]
[null,null,null,null,null,null,null,null,null,"Coahuila de Zaragoza","05","Saltillo","030"]
[null,null,null,null,null,null,null,null,null,"Coahuila de Zaragoza","05","San Buenaventura","031"]
[null,null,null,null,null,null,null,null,null,"Coahuila de Zaragoza","05","San Juan de Sabinas","032"]
[null,null,null,null,null,null,null,null,null,"Coahuila de Zaragoza","05","San Pedro","033"]
[null,"COORDINACIÓN DE REGISTRO PÚBLICO",null,null,null,null,null,null,null,"Coahuila de Zaragoza","05","Sierra Mojada","034"]
[null,"DEPARTAMENTO DE REGISTRO PÚBLICO",null,null,null,null,null,null,null,"Coahuila de Zaragoza","05","Torreón","035"]
[null,"DIRECCIÓN DE REGISTRO",null,null,null,null,null,null,null,"Coahuila de Zaragoza","05","Viesca","036"]
[null,"DIRECCIÓN DE REGISTRO PÚBLICO DE LA PROPIEDAD",null,null,null,null,null,null,null,"Coahuila de Zaragoza","05","Villa Unión","037"]
[null,"DIRECCION DE REGISTRO PUBLICO DE LA PROPIEDAD INMUEBLE Y DE COMERCIO",null,null,null,null,null,null,null,"Coahuila de Zaragoza","05","Zaragoza","038"]
[null,"DIRECCIÓN DE REGISTROS PÚBLICOS DE LA PROPIEDAD DEL ESTADO DE GUANAJUATO",null,null,null,null,null,null,null,"Colima","06","Armería","001"]
[null,"DIRECCIÓN DEL REGISTRO PÚBLICO",null,null,null,null,null,null,null,"Colima","06","Colima","002"]
[null,"DIRECCIÓN DEL REGISTRO PÚBLICO DE LA PROPIEDAD DEL ESTADO DE QUERÉTARO",null,null,null,null,null,null,null,"Colima","06","Comala","003"]
[null,"DIRECCIÓN DEL REGISTRO PÚBLICO DE LA PROPIEDAD Y DE COMERCIO PARA EL ESTADO DE BAJA CALIFORNIA",null,null,null,null,null,null,null,"Colima","06","Coquimatlán","004"]
[null,"DIRECCIÓN DEL REGISTRO PÚBLICO DE LA PROPIEDAD Y DEL COMERCIO",null,null,null,null,null,null,null,"Colima","06","Cuauhtémoc","005"]
[null,"DIRECCIÓN GENERAL DEL REGISTRO PÚBLICO DE LA PROPIEDAD Y DEL COMERCIO",null,null,null,null,null,null,null,"Colima","06","Ixtlahuacán","006"]
[null,"INSTITUTO DE LA FUNCIÓN REGISTRAL",null,null,null,null,null,null,null,"Colima","06","Manzanillo","007"]
[null,"INSTITUTO DE LA FUNCIÓN REGISTRAL DEL ESTADO DE MÉXICO",null,null,null,null,null,null,null,"Colima","06","Minatitlán","008"]
[null,"INSTITUTO DE LA FUNCION REGISTRAL DEL ESTADO DE OAXACA",null,null,null,null,null,null,null,"Colima","06","Tecomán","009"]
[null,"REGISTRO PÚBLICO DE LA PROPIEDAD Y DEL COMERCIO DEL ESTADO DE QUINTANA ROO",null,null,null,null,null,null,null,"Colima","06","Villa de Álvarez","010"]
[null,"OTRO",null,null,null,null,null,null,null,"Chiapas","07","Acacoyagua","001"]
[null,null,null,null,null,null,null,null,null,"Chiapas","07","Acala","002"]
[null,null,null,null,null,null,null,null,null,"Chiapas","07","Acapetahua","003"]
[null,null,null,null,null,null,null,null,null,"Chiapas","07","Altamirano","004"]
[null,null,null,null,null,null,null,null,null,"Chiapas","07","Amatán","005"]
[null,"CONSEJERIA JURIDICA",null,null,null,null,null,null,null,"Chiapas","07","Amatenango de la Frontera","006"]
[null,"CONSEJERÍA JURÍDICA Y DE SERVICIOS LEGALES DE LA CIUDAD DE MÉXICO",null,null,null,null,null,null,null,"Chiapas","07","Amatenango del Valle","007"]
[null,"DIRECCIÓN DE CATASTRO Y REGISTRO PÚBLICO",null,null,null,null,null,null,null,"Chiapas","07","Ángel Albino Corzo","008"]
[null,"DIRECCIÓN DE NOTARIAS Y REGISTROS PÚBLICOS DE LA PROPIEDAD",null,null,null,null,null,null,null,"Chiapas","07","Arriaga","009"]
[null,"DIRECCIÓN DEL REGISTRO PÚBLICO DE LA PROPIEDAD Y DEL NOTARIADO",null,null,null,null,null,null,null,"Chiapas","07","Bejucal de Ocampo","010"]
[null,"DIRECCIÓN GENERAL DE CATASTRO Y REGISTRO PÚBLICO DE LA PROPIEDAD Y DEL COMERCIO",null,null,null,null,null,null,null,"Chiapas","07","Bella Vista","011"]
[null,"DIRECCIÓN GENERAL DE REGISTROS PÚBLICOS DE LA PROPIEDAD Y NOTARÍAS",null,null,null,null,null,null,null,"Chiapas","07","Berriozábal","012"]
[null,"DIRECCIÓN GENERAL DEL REGISTRO PÚBLICO DE LA PROPIEDAD Y DE INSPECCIÓN Y ARCHIVO GENERAL DE NOTARIAS",null,null,null,null,null,null,null,"Chiapas","07","Bochil","013"]
[null,"GOBIERNO DEL ESTADO DE BAJA CALIFORNIA",null,null,null,null,null,null,null,"Chiapas","07","El Bosque","014"]
[null,"INSTITUTO CATASTRAL Y REGISTRAL DEL ESTADO DE SONORA",null,null,null,null,null,null,null,"Chiapas","07","Cacahoatán","015"]
[null,"INSTITUTO DE SEGURIDAD JURÍDICA PATRIMONIAL DE YUCATÁN",null,null,null,null,null,null,null,"Chiapas","07","Catazajá","016"]
[null,"INSTITUTO DE SERVICIOS REGISTRALES Y CATASTRALES",null,null,null,null,null,null,null,"Chiapas","07","Cintalapa de Figueroa","017"]
[null,"INSTITUTO PARA EL REGISTRO DEL TERRITORIO DEL ESTADO DE COLIMA",null,null,null,null,null,null,null,"Chiapas","07","Coapilla","018"]
[null,"INSTITUTO REGISTRAL Y CATASTRAL",null,null,null,null,null,null,null,"Chiapas","07","Comitán de Domínguez","019"]
[null,"INSTITUTO REGISTRAL Y CATASTRAL DEL ESTADO DE COAHUILA DE ZARAGOZA",null,null,null,null,null,null,null,"Chiapas","07","La Concordia","020"]
[null,"INSTITUTO REGISTRAL Y CATASTRAL DEL ESTADO DE PUEBLA",null,null,null,null,null,null,null,"Chiapas","07","Copainalá","021"]
[null,"INSTITUTO REGISTRAL Y CATASTRAL DEL ESTADO DE TAMAULIPAS",null,null,null,null,null,null,null,"Chiapas","07","Chalchihuitán","022"]
[null,"SECRETARÍA DE FINANZAS Y ADMINISTRACIÓN",null,null,null,null,null,null,null,"Chiapas","07","Chamula","023"]
[null,"SECRETARIA DE GESTIÓN URBANÍSTICA, ORDENAMIENTO TERRITORIAL, REGISTRAL Y CATASTRAL",null,null,null,null,null,null,null,"Chiapas","07","Chanal","024"]
[null,"SECRETARÍA DE GOBIERNO",null,null,null,null,null,null,null,"Chiapas","07","Chapultenango","025"]
[null,"SECRETARIA DE HACIENDA",null,null,null,null,null,null,null,"Chiapas","07","Chenalhó","026"]
[null,"SECRETARÍA DE JUSTICIA Y DERECHOS HUMANOS",null,null,null,null,null,null,null,"Chiapas","07","Chiapa de Corzo","027"]
[null,"SECRETARIA GENERAL DE GOBIERNO",null,null,null,null,null,null,null,"Chiapas","07","Chiapilla","028"]
[null,"SECRETARIA GENERAL DE GOBIERNO DEL ESTADO DE CHIHUAHUA",null,null,null,null,null,null,null,"Chiapas","07","Chicoasén","029"]
[null,"SECRETARÍA GENERAL DE GOBIERNO DEL ESTADO DE GUERRERO",null,null,null,null,null,null,null,"Chiapas","07","Chicomuselo","030"]
[null,"SUBSECRETARIA DE SERVICIOS Y GOBERNANZA POLÍTICA",null,null,null,null,null,null,null,"Chiapas","07","Chilón","031"]
[null,"OTRO",null,null,null,null,null,null,null,"Chiapas","07","Escuintla","032"]
[null,null,null,null,null,null,null,null,null,"Chiapas","07","Francisco León","033"]
[null,null,null,null,null,null,null,null,null,"Chiapas","07","Frontera Comalapa","034"]
[null,null,null,null,null,null,null,null,null,"Chiapas","07","Frontera Hidalgo","035"]
[null,null,null,null,null,null,null,null,null,"Chiapas","07","La Grandeza","036"]
[null,null,null,null,null,null,null,null,null,"Chiapas","07","Huehuetán","037"]
[null,null,null,null,null,null,null,null,null,"Chiapas","07","Huixtán","038"]
[null,null,null,null,null,null,null,null,null,"Chiapas","07","Huitiupán","039"]
[null,null,null,null,null,null,null,null,null,"Chiapas","07","Huixtla","040"]
[null,null,null,null,null,null,null,null,null,"Chiapas","07","La Independencia","041"]
[null,null,null,null,null,null,null,null,null,"Chiapas","07","Ixhuatán","042"]
[null,null,null,null,null,null,null,null,null,"Chiapas","07","Ixtacomitán","043"]
[null,null,null,null,null,null,null,null,null,"Chiapas","07","Ixtapa","044"]
[null,null,null,null,null,null,null,null,null,"Chiapas","07","Ixtapangajoya","045"]
[null,null,null,null,null,null,null,null,null,"Chiapas","07","Jiquipilas","046"]
[null,null,null,null,null,null,null,null,null,"Chiapas","07","Jitotol","047"]
[null,null,null,null,null,null,null,null,null,"Chiapas","07","Juárez","048"]
[null,null,null,null,null,null,null,null,null,"Chiapas","07","Larráinzar","049"]
[null,null,null,null,null,null,null,null,null,"Chiapas","07","La Libertad","050"]
[null,null,null,null,null,null,null,null,null,"Chiapas","07","Mapastepec","051"]
[null,null,null,null,null,null,null,null,null,"Chiapas","07","Las Margaritas","052"]
[null,null,null,null,null,null,null,null,null,"Chiapas","07","Mazapa de Madero","053"]
[null,null,null,null,null,null,null,null,null,"Chiapas","07","Mazatán","054"]
[null,null,null,null,null,null,null,null,null,"Chiapas","07","Metapa","055"]
[null,null,null,null,null,null,null,null,null,"Chiapas","07","Mitontic","056"]
[null,null,null,null,null,null,null,null,null,"Chiapas","07","Motozintla","057"]
[null,null,null,null,null,null,null,null,null,"Chiapas","07","Nicolás Ruíz","058"]
[null,null,null,null,null,null,null,null,null,"Chiapas","07","Ocosingo","059"]
[null,null,null,null,null,null,null,null,null,"Chiapas","07","Ocotepec","060"]
[null,null,null,null,null,null,null,null,null,"Chiapas","07","Ocozocoautla de Espinosa","061"]
[null,null,null,null,null,null,null,null,null,"Chiapas","07","Ostuacán","062"]
[null,null,null,null,null,null,null,null,null,"Chiapas","07","Osumacinta","063"]
[null,null,null,null,null,null,null,null,null,"Chiapas","07","Oxchuc","064"]
[null,null,null,null,null,null,null,null,null,"Chiapas","07","Palenque","065"]
[null,null,null,null,null,null,null,null,null,"Chiapas","07","Pantelhó","066"]
[null,null,null,null,null,null,null,null,null,"Chiapas","07","Pantepec","067"]
[null,null,null,null,null,null,null,null,null,"Chiapas","07","Pichucalco","068"]
[null,null,null,null,null,null,null,null,null,"Chiapas","07","Pijijiapan","069"]
[null,null,null,null,null,null,null,null,null,"Chiapas","07","El Porvenir","070"]
[null,null,null,null,null,null,null,null,null,"Chiapas","07","Villa Comaltitlán","071"]
[null,null,null,null,null,null,null,null,null,"Chiapas","07","Pueblo Nuevo Solistahuacán","072"]
[null,null,null,null,null,null,null,null,null,"Chiapas","07","Rayón","073"]
[null,null,null,null,null,null,null,null,null,"Chiapas","07","Reforma","074"]
[null,null,null,null,null,null,null,null,null,"Chiapas","07","Las Rosas","075"]
[null,null,null,null,null,null,null,null,null,"Chiapas","07","Sabanilla","076"]
[null,null,null,null,null,null,null,null,null,"Chiapas","07","Salto de Agua","077"]
[null,null,null,null,null,null,null,null,null,"Chiapas","07","San Cristóbal de las Casas","078"]
[null,null,null,null,null,null,null,null,null,"Chiapas","07","San Fernando","079"]
[null,null,null,null,null,null,null,null,null,"Chiapas","07","Siltepec","080"]
[null,null,null,null,null,null,null,null,null,"Chiapas","07","Simojovel","081"]
[null,null,null,null,null,null,null,null,null,"Chiapas","07","Sitalá","082"]
[null,null,null,null,null,null,null,null,null,"Chiapas","07","Socoltenango","083"]
[null,null,null,null,null,null,null,null,null,"Chiapas","07","Solosuchiapa","084"]
[null,null,null,null,null,null,null,null,null,"Chiapas","07","Soyaló","085"]
[null,null,null,null,null,null,null,null,null,"Chiapas","07","Suchiapa","086"]
[null,null,null,null,null,null,null,null,null,"Chiapas","07","Suchiate","087"]
[null,null,null,null,null,null,null,null,null,"Chiapas","07","Sunuapa","088"]
[null,null,null,null,null,null,null,null,null,"Chiapas","07","Tapachula","089"]
[null,null,null,null,null,null,null,null,null,"Chiapas","07","Tapalapa","090"]
[null,null,null,null,null,null,null,null,null,"Chiapas","07","Tapilula","091"]
[null,null,null,null,null,null,null,null,null,"Chiapas","07","Tecpatán","092"]
[null,null,null,null,null,null,null,null,null,"Chiapas","07","Tenejapa","093"]
[null,null,null,null,null,null,null,null,null,"Chiapas","07","Teopisca","094"]
[null,null,null,null,null,null,null,null,null,"Chiapas","07","Tila","096"]
[null,null,null,null,null,null,null,null,null,"Chiapas","07","Tonalá","097"]
[null,null,null,null,null,null,null,null,null,"Chiapas","07","Totolapa","098"]
[null,null,null,null,null,null,null,null,null,"Chiapas","07","La Trinitaria","099"]
[null,null,null,null,null,null,null,null,null,"Chiapas","07","Tumbalá","100"]
[null,null,null,null,null,null,null,null,null,"Chiapas","07","Tuxtla Gutiérrez","101"]
[null,null,null,null,null,null,null,null,null,"Chiapas","07","Tuxtla Chico","102"]
[null,null,null,null,null,null,null,null,null,"Chiapas","07","Tuzantán","103"]
[null,null,null,null,null,null,null,null,null,"Chiapas","07","Tzimol","104"]
[null,null,null,null,null,null,null,null,null,"Chiapas","07","Unión Juárez","105"]
[null,null,null,null,null,null,null,null,null,"Chiapas","07","Venustiano Carranza","106"]
[null,null,null,null,null,null,null,null,null,"Chiapas","07","Villa Corzo","107"]
[null,null,null,null,null,null,null,null,null,"Chiapas","07","Villaflores","108"]
[null,null,null,null,null,null,null,null,null,"Chiapas","07","Yajalón","109"]
[null,null,null,null,null,null,null,null,null,"Chiapas","07","San Lucas","110"]
[null,null,null,null,null,null,null,null,null,"Chiapas","07","Zinacantán","111"]
[null,null,null,null,null,null,null,null,null,"Chiapas","07","San Juan Cancuc","112"]
[null,null,null,null,null,null,null,null,null,"Chiapas","07","Aldama","113"]
[null,null,null,null,null,null,null,null,null,"Chiapas","07","Benemérito de las Américas","114"]
[null,null,null,null,null,null,null,null,null,"Chiapas","07","Maravilla Tenejapa","115"]
[null,null,null,null,null,null,null,null,null,"Chiapas","07","Marqués de Comillas","116"]
[null,null,null,null,null,null,null,null,null,"Chiapas","07","Montecristo de Guerrero","117"]
[null,null,null,null,null,null,null,null,null,"Chiapas","07","San Andrés Duraznal","118"]
[null,null,null,null,null,null,null,null,null,"Chiapas","07","Santiago el Pinar","119"]
[null,null,null,null,null,null,null,null,null,"Chiapas","07","Capitán Luis Ángel Vidal","120"]
[null,null,null,null,null,null,null,null,null,"Chiapas","07","Rincón Chamula San Pedro","121"]
[null,null,null,null,null,null,null,null,null,"Chiapas","07","El Parral","122"]
[null,null,null,null,null,null,null,null,null,"Chiapas","07","Emiliano Zapata","123"]
[null,null,null,null,null,null,null,null,null,"Chiapas","07","Mezcalapa","124"]
[null,null,null,null,null,null,null,null,null,"Chiapas","07","Honduras de la Sierra","125"]
[null,null,null,null,null,null,null,null,null,"Chihuahua","08","Ahumada","001"]
[null,null,null,null,null,null,null,null,null,"Chihuahua","08","Aldama","002"]
[null,null,null,null,null,null,null,null,null,"Chihuahua","08","Allende","003"]
[null,null,null,null,null,null,null,null,null,"Chihuahua","08","Aquiles Serdán","004"]
[null,null,null,null,null,null,null,null,null,"Chihuahua","08","Ascensión","005"]
[null,null,null,null,null,null,null,null,null,"Chihuahua","08","Bachíniva","006"]
[null,null,null,null,null,null,null,null,null,"Chihuahua","08","Balleza","007"]
[null,null,null,null,null,null,null,null,null,"Chihuahua","08","Batopilas de Manuel Gómez Morín","008"]
[null,null,null,null,null,null,null,null,null,"Chihuahua","08","Bocoyna","009"]
[null,null,null,null,null,null,null,null,null,"Chihuahua","08","Buenaventura","010"]
[null,null,null,null,null,null,null,null,null,"Chihuahua","08","Camargo","011"]
[null,null,null,null,null,null,null,null,null,"Chihuahua","08","Carichí","012"]
[null,null,null,null,null,null,null,null,null,"Chihuahua","08","Casas Grandes","013"]
[null,null,null,null,null,null,null,null,null,"Chihuahua","08","Coronado","014"]
[null,null,null,null,null,null,null,null,null,"Chihuahua","08","Coyame del Sotol","015"]
[null,null,null,null,null,null,null,null,null,"Chihuahua","08","La Cruz","016"]
[null,null,null,null,null,null,null,null,null,"Chihuahua","08","Cuauhtémoc","017"]
[null,null,null,null,null,null,null,null,null,"Chihuahua","08","Cusihuiriachi","018"]
[null,null,null,null,null,null,null,null,null,"Chihuahua","08","Chihuahua","019"]
[null,null,null,null,null,null,null,null,null,"Chihuahua","08","Chínipas","020"]
[null,null,null,null,null,null,null,null,null,"Chihuahua","08","Delicias","021"]
[null,null,null,null,null,null,null,null,null,"Chihuahua","08","Dr. Belisario Domínguez","022"]
[null,null,null,null,null,null,null,null,null,"Chihuahua","08","Galeana","023"]
[null,null,null,null,null,null,null,null,null,"Chihuahua","08","Santa Isabel","024"]
[null,null,null,null,null,null,null,null,null,"Chihuahua","08","Gómez Farías","025"]
[null,null,null,null,null,null,null,null,null,"Chihuahua","08","Gran Morelos","026"]
[null,null,null,null,null,null,null,null,null,"Chihuahua","08","Guachochi","027"]
[null,null,null,null,null,null,null,null,null,"Chihuahua","08","Guadalupe","028"]
[null,null,null,null,null,null,null,null,null,"Chihuahua","08","Guadalupe y Calvo","029"]
[null,null,null,null,null,null,null,null,null,"Chihuahua","08","Guazapares","030"]
[null,null,null,null,null,null,null,null,null,"Chihuahua","08","Guerrero","031"]
[null,null,null,null,null,null,null,null,null,"Chihuahua","08","Hidalgo del Parral","032"]
[null,null,null,null,null,null,null,null,null,"Chihuahua","08","Huejotitán","033"]
[null,null,null,null,null,null,null,null,null,"Chihuahua","08","Ignacio Zaragoza","034"]
[null,null,null,null,null,null,null,null,null,"Chihuahua","08","Janos","035"]
[null,null,null,null,null,null,null,null,null,"Chihuahua","08","Jiménez","036"]
[null,null,null,null,null,null,null,null,null,"Chihuahua","08","Juárez","037"]
[null,null,null,null,null,null,null,null,null,"Chihuahua","08","Julimes","038"]
[null,null,null,null,null,null,null,null,null,"Chihuahua","08","López","039"]
[null,null,null,null,null,null,null,null,null,"Chihuahua","08","Madera","040"]
[null,null,null,null,null,null,null,null,null,"Chihuahua","08","Maguarichi","041"]
[null,null,null,null,null,null,null,null,null,"Chihuahua","08","Manuel Benavides","042"]
[null,null,null,null,null,null,null,null,null,"Chihuahua","08","Matachí","043"]
[null,null,null,null,null,null,null,null,null,"Chihuahua","08","Matamoros","044"]
[null,null,null,null,null,null,null,null,null,"Chihuahua","08","Meoqui","045"]
[null,null,null,null,null,null,null,null,null,"Chihuahua","08","Morelos","046"]
[null,null,null,null,null,null,null,null,null,"Chihuahua","08","Moris","047"]
[null,null,null,null,null,null,null,null,null,"Chihuahua","08","Namiquipa","048"]
[null,null,null,null,null,null,null,null,null,"Chihuahua","08","Nonoava","049"]
[null,null,null,null,null,null,null,null,null,"Chihuahua","08","Nuevo Casas Grandes","050"]
[null,null,null,null,null,null,null,null,null,"Chihuahua","08","Ocampo","051"]
[null,null,null,null,null,null,null,null,null,"Chihuahua","08","Ojinaga","052"]
[null,null,null,null,null,null,null,null,null,"Chihuahua","08","Praxedis G. Guerrero","053"]
[null,null,null,null,null,null,null,null,null,"Chihuahua","08","Riva Palacio","054"]
[null,null,null,null,null,null,null,null,null,"Chihuahua","08","Rosales","055"]
[null,null,null,null,null,null,null,null,null,"Chihuahua","08","Rosario","056"]
[null,null,null,null,null,null,null,null,null,"Chihuahua","08","San Francisco de Borja","057"]
[null,null,null,null,null,null,null,null,null,"Chihuahua","08","San Francisco de Conchos","058"]
[null,null,null,null,null,null,null,null,null,"Chihuahua","08","San Francisco del Oro","059"]
[null,null,null,null,null,null,null,null,null,"Chihuahua","08","Santa Bárbara","060"]
[null,null,null,null,null,null,null,null,null,"Chihuahua","08","Satevó","061"]
[null,null,null,null,null,null,null,null,null,"Chihuahua","08","Saucillo","062"]
[null,null,null,null,null,null,null,null,null,"Chihuahua","08","Temósachic","063"]
[null,null,null,null,null,null,null,null,null,"Chihuahua","08","El Tule","064"]
[null,null,null,null,null,null,null,null,null,"Chihuahua","08","Urique","065"]
[null,null,null,null,null,null,null,null,null,"Chihuahua","08","Uruachi","066"]
[null,null,null,null,null,null,null,null,null,"Chihuahua","08","Valle de Zaragoza","067"]
[null,null,null,null,null,null,null,null,null,"Ciudad de México","09","Azcapotzalco","002"]
[null,null,null,null,null,null,null,null,null,"Ciudad de México","09","Coyoacán","003"]
[null,null,null,null,null,null,null,null,null,"Ciudad de México","09","Cuajimalpa de Morelos","004"]
[null,null,null,null,null,null,null,null,null,"Ciudad de México","09","Gustavo A. Madero","005"]
[null,null,null,null,null,null,null,null,null,"Ciudad de México","09","Iztacalco","006"]
[null,null,null,null,null,null,null,null,null,"Ciudad de México","09","Iztapalapa","007"]
[null,null,null,null,null,null,null,null,null,"Ciudad de México","09","La Magdalena Contreras","008"]
[null,null,null,null,null,null,null,null,null,"Ciudad de México","09","Milpa Alta","009"]
[null,null,null,null,null,null,null,null,null,"Ciudad de México","09","Álvaro Obregón","010"]
[null,null,null,null,null,null,null,null,null,"Ciudad de México","09","Tláhuac","011"]
[null,null,null,null,null,null,null,null,null,"Ciudad de México","09","Tlalpan","012"]
[null,null,null,null,null,null,null,null,null,"Ciudad de México","09","Xochimilco","013"]
[null,null,null,null,null,null,null,null,null,"Ciudad de México","09","Benito Juárez","014"]
[null,null,null,null,null,null,null,null,null,"Ciudad de México","09","Cuauhtémoc","015"]
[null,null,null,null,null,null,null,null,null,"Ciudad de México","09","Miguel Hidalgo","016"]
[null,null,null,null,null,null,null,null,null,"Ciudad de México","09","Venustiano Carranza","017"]
[null,null,null,null,null,null,null,null,null,"Durango","10","Canatlán","001"]
[null,null,null,null,null,null,null,null,null,"Durango","10","Canelas","002"]
[null,null,null,null,null,null,null,null,null,"Durango","10","Coneto de Comonfort","003"]
[null,null,null,null,null,null,null,null,null,"Durango","10","Cuencamé","004"]
[null,null,null,null,null,null,null,null,null,"Durango","10","Durango","005"]
[null,null,null,null,null,null,null,null,null,"Durango","10","General Simón Bolívar","006"]
[null,null,null,null,null,null,null,null,null,"Durango","10","Gómez Palacio","007"]
[null,null,null,null,null,null,null,null,null,"Durango","10","Guadalupe Victoria","008"]
[null,null,null,null,null,null,null,null,null,"Durango","10","Guanaceví","009"]
[null,null,null,null,null,null,null,null,null,"Durango","10","Hidalgo","010"]
[null,null,null,null,null,null,null,null,null,"Durango","10","Indé","011"]
[null,null,null,null,null,null,null,null,null,"Durango","10","Lerdo","012"]
[null,null,null,null,null,null,null,null,null,"Durango","10","Mapimí","013"]
[null,null,null,null,null,null,null,null,null,"Durango","10","Mezquital","014"]
[null,null,null,null,null,null,null,null,null,"Durango","10","Nazas","015"]
[null,null,null,null,null,null,null,null,null,"Durango","10","Nombre de Dios","016"]
[null,null,null,null,null,null,null,null,null,"Durango","10","Ocampo","017"]
[null,null,null,null,null,null,null,null,null,"Durango","10","El Oro","018"]
[null,null,null,null,null,null,null,null,null,"Durango","10","Otáez","019"]
[null,null,null,null,null,null,null,null,null,"Durango","10","Pánuco de Coronado","020"]
[null,null,null,null,null,null,null,null,null,"Durango","10","Peñón Blanco","021"]
[null,null,null,null,null,null,null,null,null,"Durango","10","Poanas","022"]
[null,null,null,null,null,null,null,null,null,"Durango","10","Pueblo Nuevo","023"]
[null,null,null,null,null,null,null,null,null,"Durango","10","Rodeo","024"]
[null,null,null,null,null,null,null,null,null,"Durango","10","San Bernardo","025"]
[null,null,null,null,null,null,null,null,null,"Durango","10","San Dimas","026"]
[null,null,null,null,null,null,null,null,null,"Durango","10","San Juan de Guadalupe","027"]
[null,null,null,null,null,null,null,null,null,"Durango","10","San Juan del Río","028"]
[null,null,null,null,null,null,null,null,null,"Durango","10","San Luis del Cordero","029"]
[null,null,null,null,null,null,null,null,null,"Durango","10","San Pedro del Gallo","030"]
[null,null,null,null,null,null,null,null,null,"Durango","10","Santa Clara","031"]
[null,null,null,null,null,null,null,null,null,"Durango","10","Santiago Papasquiaro","032"]
[null,null,null,null,null,null,null,null,null,"Durango","10","Súchil","033"]
[null,null,null,null,null,null,null,null,null,"Durango","10","Tamazula","034"]
[null,null,null,null,null,null,null,null,null,"Durango","10","Tepehuanes","035"]
[null,null,null,null,null,null,null,null,null,"Durango","10","Tlahualilo","036"]
[null,null,null,null,null,null,null,null,null,"Durango","10","Topia","037"]
[null,null,null,null,null,null,null,null,null,"Durango","10","Vicente Guerrero","038"]
[null,null,null,null,null,null,null,null,null,"Durango","10","Nuevo Ideal","039"]
[null,null,null,null,null,null,null,null,null,"Guanajuato","11","Abasolo","001"]
[null,null,null,null,null,null,null,null,null,"Guanajuato","11","Acámbaro","002"]
[null,null,null,null,null,null,null,null,null,"Guanajuato","11","San Miguel de Allende","003"]
[null,null,null,null,null,null,null,null,null,"Guanajuato","11","Apaseo el Alto","004"]
[null,null,null,null,null,null,null,null,null,"Guanajuato","11","Apaseo el Grande","005"]
[null,null,null,null,null,null,null,null,null,"Guanajuato","11","Atarjea","006"]
[null,null,null,null,null,null,null,null,null,"Guanajuato","11","Celaya","007"]
[null,null,null,null,null,null,null,null,null,"Guanajuato","11","Manuel Doblado","008"]
[null,null,null,null,null,null,null,null,null,"Guanajuato","11","Comonfort","009"]
[null,null,null,null,null,null,null,null,null,"Guanajuato","11","Coroneo","010"]
[null,null,null,null,null,null,null,null,null,"Guanajuato","11","Cortazar","011"]
[null,null,null,null,null,null,null,null,null,"Guanajuato","11","Cuerámaro","012"]
[null,null,null,null,null,null,null,null,null,"Guanajuato","11","Doctor Mora","013"]
[null,null,null,null,null,null,null,null,null,"Guanajuato","11","Dolores Hidalgo Cuna de la Independencia Nacional","014"]
[null,null,null,null,null,null,null,null,null,"Guanajuato","11","Guanajuato","015"]
[null,null,null,null,null,null,null,null,null,"Guanajuato","11","Huanímaro","016"]
[null,null,null,null,null,null,null,null,null,"Guanajuato","11","Irapuato","017"]
[null,null,null,null,null,null,null,null,null,"Guanajuato","11","Jaral del Progreso","018"]
[null,null,null,null,null,null,null,null,null,"Guanajuato","11","Jerécuaro","019"]
[null,null,null,null,null,null,null,null,null,"Guanajuato","11","León","020"]
[null,null,null,null,null,null,null,null,null,"Guanajuato","11","Moroleón","021"]
[null,null,null,null,null,null,null,null,null,"Guanajuato","11","Ocampo","022"]
[null,null,null,null,null,null,null,null,null,"Guanajuato","11","Pénjamo","023"]
[null,null,null,null,null,null,null,null,null,"Guanajuato","11","Pueblo Nuevo","024"]
[null,null,null,null,null,null,null,null,null,"Guanajuato","11","Purísima del Rincón","025"]
[null,null,null,null,null,null,null,null,null,"Guanajuato","11","Romita","026"]
[null,null,null,null,null,null,null,null,null,"Guanajuato","11","Salamanca","027"]
[null,null,null,null,null,null,null,null,null,"Guanajuato","11","Salvatierra","028"]
[null,null,null,null,null,null,null,null,null,"Guanajuato","11","San Diego de la Unión","029"]
[null,null,null,null,null,null,null,null,null,"Guanajuato","11","San Felipe","030"]
[null,null,null,null,null,null,null,null,null,"Guanajuato","11","San Francisco del Rincón","031"]
[null,null,null,null,null,null,null,null,null,"Guanajuato","11","San José Iturbide","032"]
[null,null,null,null,null,null,null,null,null,"Guanajuato","11","San Luis de la Paz","033"]
[null,null,null,null,null,null,null,null,null,"Guanajuato","11","Santa Catarina","034"]
[null,null,null,null,null,null,null,null,null,"Guanajuato","11","Santa Cruz de Juventino Rosas","035"]
[null,null,null,null,null,null,null,null,null,"Guanajuato","11","Santiago Maravatío","036"]
[null,null,null,null,null,null,null,null,null,"Guanajuato","11","Silao de la Victoria","037"]
[null,null,null,null,null,null,null,null,null,"Guanajuato","11","Tarandacuao","038"]
[null,null,null,null,null,null,null,null,null,"Guanajuato","11","Tarimoro","039"]
[null,null,null,null,null,null,null,null,null,"Guanajuato","11","Tierra Blanca","040"]
[null,null,null,null,null,null,null,null,null,"Guanajuato","11","Uriangato","041"]
[null,null,null,null,null,null,null,null,null,"Guanajuato","11","Valle de Santiago","042"]
[null,null,null,null,null,null,null,null,null,"Guanajuato","11","Victoria","043"]
[null,null,null,null,null,null,null,null,null,"Guanajuato","11","Villagrán","044"]
[null,null,null,null,null,null,null,null,null,"Guanajuato","11","Xichú","045"]
[null,null,null,null,null,null,null,null,null,"Guanajuato","11","Yuriria","046"]
[null,null,null,null,null,null,null,null,null,"Guerrero","12","Acapulco de Juárez","001"]
[null,null,null,null,null,null,null,null,null,"Guerrero","12","Ahuacuotzingo","002"]
[null,null,null,null,null,null,null,null,null,"Guerrero","12","Ajuchitlán del Progreso","003"]
[null,null,null,null,null,null,null,null,null,"Guerrero","12","Alcozauca de Guerrero","004"]
[null,null,null,null,null,null,null,null,null,"Guerrero","12","Alpoyeca","005"]
[null,null,null,null,null,null,null,null,null,"Guerrero","12","Apaxtla","006"]
[null,null,null,null,null,null,null,null,null,"Guerrero","12","Arcelia","007"]
[null,null,null,null,null,null,null,null,null,"Guerrero","12","Atenango del Río","008"]
[null,null,null,null,null,null,null,null,null,"Guerrero","12","Atlamajalcingo del Monte","009"]
[null,null,null,null,null,null,null,null,null,"Guerrero","12","Atlixtac","010"]
[null,null,null,null,null,null,null,null,null,"Guerrero","12","Atoyac de Álvarez","011"]
[null,null,null,null,null,null,null,null,null,"Guerrero","12","Ayutla de los Libres","012"]
[null,null,null,null,null,null,null,null,null,"Guerrero","12","Azoyú","013"]
[null,null,null,null,null,null,null,null,null,"Guerrero","12","Benito Juárez","014"]
[null,null,null,null,null,null,null,null,null,"Guerrero","12","Buenavista de Cuéllar","015"]
[null,null,null,null,null,null,null,null,null,"Guerrero","12","Coahuayutla de José María Izazaga","016"]
[null,null,null,null,null,null,null,null,null,"Guerrero","12","Cocula","017"]
[null,null,null,null,null,null,null,null,null,"Guerrero","12","Copala","018"]
[null,null,null,null,null,null,null,null,null,"Guerrero","12","Copalillo","019"]
[null,null,null,null,null,null,null,null,null,"Guerrero","12","Copanatoyac","020"]
[null,null,null,null,null,null,null,null,null,"Guerrero","12","Coyuca de Benítez","021"]
[null,null,null,null,null,null,null,null,null,"Guerrero","12","Coyuca de Catalán","022"]
[null,null,null,null,null,null,null,null,null,"Guerrero","12","Cuajinicuilapa","023"]
[null,null,null,null,null,null,null,null,null,"Guerrero","12","Cualác","024"]
[null,null,null,null,null,null,null,null,null,"Guerrero","12","Cuautepec","025"]
[null,null,null,null,null,null,null,null,null,"Guerrero","12","Cuetzala del Progreso","026"]
[null,null,null,null,null,null,null,null,null,"Guerrero","12","Cutzamala de Pinzón","027"]
[null,null,null,null,null,null,null,null,null,"Guerrero","12","Chilapa de Álvarez","028"]
[null,null,null,null,null,null,null,null,null,"Guerrero","12","Chilpancingo de los Bravo","029"]
[null,null,null,null,null,null,null,null,null,"Guerrero","12","Florencio Villarreal","030"]
[null,null,null,null,null,null,null,null,null,"Guerrero","12","General Canuto A. Neri","031"]
[null,null,null,null,null,null,null,null,null,"Guerrero","12","General Heliodoro Castillo","032"]
[null,null,null,null,null,null,null,null,null,"Guerrero","12","Huamuxtitlán","033"]
[null,null,null,null,null,null,null,null,null,"Guerrero","12","Huitzuco de los Figueroa","034"]
[null,null,null,null,null,null,null,null,null,"Guerrero","12","Iguala de la Independencia","035"]
[null,null,null,null,null,null,null,null,null,"Guerrero","12","Igualapa","036"]
[null,null,null,null,null,null,null,null,null,"Guerrero","12","Ixcateopan de Cuauhtémoc","037"]
[null,null,null,null,null,null,null,null,null,"Guerrero","12","Zihuatanejo de Azueta","038"]
[null,null,null,null,null,null,null,null,null,"Guerrero","12","Juan R. Escudero","039"]
[null,null,null,null,null,null,null,null,null,"Guerrero","12","Leonardo Bravo","040"]
[null,null,null,null,null,null,null,null,null,"Guerrero","12","Malinaltepec","041"]
[null,null,null,null,null,null,null,null,null,"Guerrero","12","Mártir de Cuilapan","042"]
[null,null,null,null,null,null,null,null,null,"Guerrero","12","Metlatónoc","043"]
[null,null,null,null,null,null,null,null,null,"Guerrero","12","Mochitlán","044"]
[null,null,null,null,null,null,null,null,null,"Guerrero","12","Olinalá","045"]
[null,null,null,null,null,null,null,null,null,"Guerrero","12","Ometepec","046"]
[null,null,null,null,null,null,null,null,null,"Guerrero","12","Pedro Ascencio Alquisiras","047"]
[null,null,null,null,null,null,null,null,null,"Guerrero","12","Petatlán","048"]
[null,null,null,null,null,null,null,null,null,"Guerrero","12","Pilcaya","049"]
[null,null,null,null,null,null,null,null,null,"Guerrero","12","Pungarabato","050"]
[null,null,null,null,null,null,null,null,null,"Guerrero","12","Quechultenango","051"]
[null,null,null,null,null,null,null,null,null,"Guerrero","12","San Luis Acatlán","052"]
[null,null,null,null,null,null,null,null,null,"Guerrero","12","San Marcos","053"]
[null,null,null,null,null,null,null,null,null,"Guerrero","12","San Miguel Totolapan","054"]
[null,null,null,null,null,null,null,null,null,"Guerrero","12","Taxco de Alarcón","055"]
[null,null,null,null,null,null,null,null,null,"Guerrero","12","Tecoanapa","056"]
[null,null,null,null,null,null,null,null,null,"Guerrero","12","Técpan de Galeana","057"]
[null,null,null,null,null,null,null,null,null,"Guerrero","12","Teloloapan","058"]
[null,null,null,null,null,null,null,null,null,"Guerrero","12","Tepecoacuilco de Trujano","059"]
[null,null,null,null,null,null,null,null,null,"Guerrero","12","Tetipac","060"]
[null,null,null,null,null,null,null,null,null,"Guerrero","12","Tixtla de Guerrero","061"]
[null,null,null,null,null,null,null,null,null,"Guerrero","12","Tlacoachistlahuaca","062"]
[null,null,null,null,null,null,null,null,null,"Guerrero","12","Tlacoapa","063"]
[null,null,null,null,null,null,null,null,null,"Guerrero","12","Tlalchapa","064"]
[null,null,null,null,null,null,null,null,null,"Guerrero","12","Tlalixtaquilla de Maldonado","065"]
[null,null,null,null,null,null,null,null,null,"Guerrero","12","Tlapa de Comonfort","066"]
[null,null,null,null,null,null,null,null,null,"Guerrero","12","Tlapehuala","067"]
[null,null,null,null,null,null,null,null,null,"Guerrero","12","La Unión de Isidoro Montes de Oca","068"]
[null,null,null,null,null,null,null,null,null,"Guerrero","12","Xalpatláhuac","069"]
[null,null,null,null,null,null,null,null,null,"Guerrero","12","Xochihuehuetlán","070"]
[null,null,null,null,null,null,null,null,null,"Guerrero","12","Xochistlahuaca","071"]
[null,null,null,null,null,null,null,null,null,"Guerrero","12","Zapotitlán Tablas","072"]
[null,null,null,null,null,null,null,null,null,"Guerrero","12","Zirándaro","073"]
[null,null,null,null,null,null,null,null,null,"Guerrero","12","Zitlala","074"]
[null,null,null,null,null,null,null,null,null,"Guerrero","12","Eduardo Neri","075"]
[null,null,null,null,null,null,null,null,null,"Guerrero","12","Acatepec","076"]
[null,null,null,null,null,null,null,null,null,"Guerrero","12","Marquelia","077"]
[null,null,null,null,null,null,null,null,null,"Guerrero","12","Cochoapa el Grande","078"]
[null,null,null,null,null,null,null,null,null,"Guerrero","12","José Joaquín de Herrera","079"]
[null,null,null,null,null,null,null,null,null,"Guerrero","12","Juchitán","080"]
[null,null,null,null,null,null,null,null,null,"Guerrero","12","Iliatenco","081"]
[null,null,null,null,null,null,null,null,null,"Guerrero","12","Las Vigas","082"]
[null,null,null,null,null,null,null,null,null,"Guerrero","12","Ñuu Savi","083"]
[null,null,null,null,null,null,null,null,null,"Guerrero","12","Santa Cruz del Rincón","084"]
[null,null,null,null,null,null,null,null,null,"Guerrero","12","San Nicolás","085"]
[null,null,null,null,null,null,null,null,null,"Hidalgo","13","Acatlán","001"]
[null,null,null,null,null,null,null,null,null,"Hidalgo","13","Acaxochitlán","002"]
[null,null,null,null,null,null,null,null,null,"Hidalgo","13","Actopan","003"]
[null,null,null,null,null,null,null,null,null,"Hidalgo","13","Agua Blanca de Iturbide","004"]
[null,null,null,null,null,null,null,null,null,"Hidalgo","13","Ajacuba","005"]
[null,null,null,null,null,null,null,null,null,"Hidalgo","13","Alfajayucan","006"]
[null,null,null,null,null,null,null,null,null,"Hidalgo","13","Almoloya","007"]
[null,null,null,null,null,null,null,null,null,"Hidalgo","13","Apan","008"]
[null,null,null,null,null,null,null,null,null,"Hidalgo","13","El Arenal","009"]
[null,null,null,null,null,null,null,null,null,"Hidalgo","13","Atitalaquia","010"]
[null,null,null,null,null,null,null,null,null,"Hidalgo","13","Atlapexco","011"]
[null,null,null,null,null,null,null,null,null,"Hidalgo","13","Atotonilco el Grande","012"]
[null,null,null,null,null,null,null,null,null,"Hidalgo","13","Atotonilco de Tula","013"]
[null,null,null,null,null,null,null,null,null,"Hidalgo","13","Calnali","014"]
[null,null,null,null,null,null,null,null,null,"Hidalgo","13","Cardonal","015"]
[null,null,null,null,null,null,null,null,null,"Hidalgo","13","Cuautepec de Hinojosa","016"]
[null,null,null,null,null,null,null,null,null,"Hidalgo","13","Chapantongo","017"]
[null,null,null,null,null,null,null,null,null,"Hidalgo","13","Chapulhuacán","018"]
[null,null,null,null,null,null,null,null,null,"Hidalgo","13","Chilcuautla","019"]
[null,null,null,null,null,null,null,null,null,"Hidalgo","13","Eloxochitlán","020"]
[null,null,null,null,null,null,null,null,null,"Hidalgo","13","Emiliano Zapata","021"]
[null,null,null,null,null,null,null,null,null,"Hidalgo","13","Epazoyucan","022"]
[null,null,null,null,null,null,null,null,null,"Hidalgo","13","Francisco I. Madero","023"]
[null,null,null,null,null,null,null,null,null,"Hidalgo","13","Huasca de Ocampo","024"]
[null,null,null,null,null,null,null,null,null,"Hidalgo","13","Huautla","025"]
[null,null,null,null,null,null,null,null,null,"Hidalgo","13","Huazalingo","026"]
[null,null,null,null,null,null,null,null,null,"Hidalgo","13","Huehuetla","027"]
[null,null,null,null,null,null,null,null,null,"Hidalgo","13","Huejutla de Reyes","028"]
[null,null,null,null,null,null,null,null,null,"Hidalgo","13","Huichapan","029"]
[null,null,null,null,null,null,null,null,null,"Hidalgo","13","Ixmiquilpan","030"]
[null,null,null,null,null,null,null,null,null,"Hidalgo","13","Jacala de Ledezma","031"]
[null,null,null,null,null,null,null,null,null,"Hidalgo","13","Jaltocán","032"]
[null,null,null,null,null,null,null,null,null,"Hidalgo","13","Juárez Hidalgo","033"]
[null,null,null,null,null,null,null,null,null,"Hidalgo","13","Lolotla","034"]
[null,null,null,null,null,null,null,null,null,"Hidalgo","13","Metepec","035"]
[null,null,null,null,null,null,null,null,null,"Hidalgo","13","San Agustín Metzquititlán","036"]
[null,null,null,null,null,null,null,null,null,"Hidalgo","13","Metztitlán","037"]
[null,null,null,null,null,null,null,null,null,"Hidalgo","13","Mineral del Chico","038"]
[null,null,null,null,null,null,null,null,null,"Hidalgo","13","Mineral del Monte","039"]
[null,null,null,null,null,null,null,null,null,"Hidalgo","13","La Misión","040"]
[null,null,null,null,null,null,null,null,null,"Hidalgo","13","Mixquiahuala de Juárez","041"]
[null,null,null,null,null,null,null,null,null,"Hidalgo","13","Molango de Escamilla","042"]
[null,null,null,null,null,null,null,null,null,"Hidalgo","13","Nicolás Flores","043"]
[null,null,null,null,null,null,null,null,null,"Hidalgo","13","Nopala de Villagrán","044"]
[null,null,null,null,null,null,null,null,null,"Hidalgo","13","Omitlán de Juárez","045"]
[null,null,null,null,null,null,null,null,null,"Hidalgo","13","San Felipe Orizatlán","046"]
[null,null,null,null,null,null,null,null,null,"Hidalgo","13","Pacula","047"]
[null,null,null,null,null,null,null,null,null,"Hidalgo","13","Pachuca de Soto","048"]
[null,null,null,null,null,null,null,null,null,"Hidalgo","13","Pisaflores","049"]
[null,null,null,null,null,null,null,null,null,"Hidalgo","13","Progreso de Obregón","050"]
[null,null,null,null,null,null,null,null,null,"Hidalgo","13","Mineral de la Reforma","051"]
[null,null,null,null,null,null,null,null,null,"Hidalgo","13","San Agustín Tlaxiaca","052"]
[null,null,null,null,null,null,null,null,null,"Hidalgo","13","San Bartolo Tutotepec","053"]
[null,null,null,null,null,null,null,null,null,"Hidalgo","13","San Salvador","054"]
[null,null,null,null,null,null,null,null,null,"Hidalgo","13","Santiago de Anaya","055"]
[null,null,null,null,null,null,null,null,null,"Hidalgo","13","Santiago Tulantepec de Lugo Guerrero","056"]
[null,null,null,null,null,null,null,null,null,"Hidalgo","13","Singuilucan","057"]
[null,null,null,null,null,null,null,null,null,"Hidalgo","13","Tasquillo","058"]
[null,null,null,null,null,null,null,null,null,"Hidalgo","13","Tecozautla","059"]
[null,null,null,null,null,null,null,null,null,"Hidalgo","13","Tenango de Doria","060"]
[null,null,null,null,null,null,null,null,null,"Hidalgo","13","Tepeapulco","061"]
[null,null,null,null,null,null,null,null,null,"Hidalgo","13","Tepehuacán de Guerrero","062"]
[null,null,null,null,null,null,null,null,null,"Hidalgo","13","Tepeji del Río de Ocampo","063"]
[null,null,null,null,null,null,null,null,null,"Hidalgo","13","Tepetitlán","064"]
[null,null,null,null,null,null,null,null,null,"Hidalgo","13","Tetepango","065"]
[null,null,null,null,null,null,null,null,null,"Hidalgo","13","Villa de Tezontepec","066"]
[null,null,null,null,null,null,null,null,null,"Hidalgo","13","Tezontepec de Aldama","067"]
[null,null,null,null,null,null,null,null,null,"Hidalgo","13","Tianguistengo","068"]
[null,null,null,null,null,null,null,null,null,"Hidalgo","13","Tizayuca","069"]
[null,null,null,null,null,null,null,null,null,"Hidalgo","13","Tlahuelilpan","070"]
[null,null,null,null,null,null,null,null,null,"Hidalgo","13","Tlahuiltepa","071"]
[null,null,null,null,null,null,null,null,null,"Hidalgo","13","Tlanalapa","072"]
[null,null,null,null,null,null,null,null,null,"Hidalgo","13","Tlanchinol","073"]
[null,null,null,null,null,null,null,null,null,"Hidalgo","13","Tlaxcoapan","074"]
[null,null,null,null,null,null,null,null,null,"Hidalgo","13","Tolcayuca","075"]
[null,null,null,null,null,null,null,null,null,"Hidalgo","13","Tula de Allende","076"]
[null,null,null,null,null,null,null,null,null,"Hidalgo","13","Tulancingo de Bravo","077"]
[null,null,null,null,null,null,null,null,null,"Hidalgo","13","Xochiatipan","078"]
[null,null,null,null,null,null,null,null,null,"Hidalgo","13","Xochicoatlán","079"]
[null,null,null,null,null,null,null,null,null,"Hidalgo","13","Yahualica","080"]
[null,null,null,null,null,null,null,null,null,"Hidalgo","13","Zacualtipán de Ángeles","081"]
[null,null,null,null,null,null,null,null,null,"Hidalgo","13","Zapotlán de Juárez","082"]
[null,null,null,null,null,null,null,null,null,"Hidalgo","13","Zempoala","083"]
[null,null,null,null,null,null,null,null,null,"Hidalgo","13","Zimapán","084"]
[null,null,null,null,null,null,null,null,null,"Jalisco","14","Acatic","001"]
[null,null,null,null,null,null,null,null,null,"Jalisco","14","Acatlán de Juárez","002"]
[null,null,null,null,null,null,null,null,null,"Jalisco","14","Ahualulco de Mercado","003"]
[null,null,null,null,null,null,null,null,null,"Jalisco","14","Amacueca","004"]
[null,null,null,null,null,null,null,null,null,"Jalisco","14","Amatitán","005"]
[null,null,null,null,null,null,null,null,null,"Jalisco","14","Ameca","006"]
[null,null,null,null,null,null,null,null,null,"Jalisco","14","San Juanito de Escobedo","007"]
[null,null,null,null,null,null,null,null,null,"Jalisco","14","Arandas","008"]
[null,null,null,null,null,null,null,null,null,"Jalisco","14","El Arenal","009"]
[null,null,null,null,null,null,null,null,null,"Jalisco","14","Atemajac de Brizuela","010"]
[null,null,null,null,null,null,null,null,null,"Jalisco","14","Atengo","011"]
[null,null,null,null,null,null,null,null,null,"Jalisco","14","Atenguillo","012"]
[null,null,null,null,null,null,null,null,null,"Jalisco","14","Atotonilco el Alto","013"]
[null,null,null,null,null,null,null,null,null,"Jalisco","14","Atoyac","014"]
[null,null,null,null,null,null,null,null,null,"Jalisco","14","Autlán de Navarro","015"]
[null,null,null,null,null,null,null,null,null,"Jalisco","14","Ayotlán","016"]
[null,null,null,null,null,null,null,null,null,"Jalisco","14","Ayutla","017"]
[null,null,null,null,null,null,null,null,null,"Jalisco","14","La Barca","018"]
[null,null,null,null,null,null,null,null,null,"Jalisco","14","Bolaños","019"]
[null,null,null,null,null,null,null,null,null,"Jalisco","14","Cabo Corrientes","020"]
[null,null,null,null,null,null,null,null,null,"Jalisco","14","Casimiro Castillo","021"]
[null,null,null,null,null,null,null,null,null,"Jalisco","14","Cihuatlán","022"]
[null,null,null,null,null,null,null,null,null,"Jalisco","14","Zapotlán el Grande","023"]
[null,null,null,null,null,null,null,null,null,"Jalisco","14","Cocula","024"]
[null,null,null,null,null,null,null,null,null,"Jalisco","14","Colotlán","025"]
[null,null,null,null,null,null,null,null,null,"Jalisco","14","Concepción de Buenos Aires","026"]
[null,null,null,null,null,null,null,null,null,"Jalisco","14","Cuautitlán de García Barragán","027"]
[null,null,null,null,null,null,null,null,null,"Jalisco","14","Cuautla","028"]
[null,null,null,null,null,null,null,null,null,"Jalisco","14","Cuquío","029"]
[null,null,null,null,null,null,null,null,null,"Jalisco","14","Chapala","030"]
[null,null,null,null,null,null,null,null,null,"Jalisco","14","Chimaltitán","031"]
[null,null,null,null,null,null,null,null,null,"Jalisco","14","Chiquilistlán","032"]
[null,null,null,null,null,null,null,null,null,"Jalisco","14","Degollado","033"]
[null,null,null,null,null,null,null,null,null,"Jalisco","14","Ejutla","034"]
[null,null,null,null,null,null,null,null,null,"Jalisco","14","Encarnación de Díaz","035"]
[null,null,null,null,null,null,null,null,null,"Jalisco","14","Etzatlán","036"]
[null,null,null,null,null,null,null,null,null,"Jalisco","14","El Grullo","037"]
[null,null,null,null,null,null,null,null,null,"Jalisco","14","Guachinango","038"]
[null,null,null,null,null,null,null,null,null,"Jalisco","14","Guadalajara","039"]
[null,null,null,null,null,null,null,null,null,"Jalisco","14","Hostotipaquillo","040"]
[null,null,null,null,null,null,null,null,null,"Jalisco","14","Huejúcar","041"]
[null,null,null,null,null,null,null,null,null,"Jalisco","14","Huejuquilla el Alto","042"]
[null,null,null,null,null,null,null,null,null,"Jalisco","14","La Huerta","043"]
[null,null,null,null,null,null,null,null,null,"Jalisco","14","Ixtlahuacán de los Membrillos","044"]
[null,null,null,null,null,null,null,null,null,"Jalisco","14","Ixtlahuacán del Río","045"]
[null,null,null,null,null,null,null,null,null,"Jalisco","14","Jalostotitlán","046"]
[null,null,null,null,null,null,null,null,null,"Jalisco","14","Jamay","047"]
[null,null,null,null,null,null,null,null,null,"Jalisco","14","Jesús María","048"]
[null,null,null,null,null,null,null,null,null,"Jalisco","14","Jilotlán de los Dolores","049"]
[null,null,null,null,null,null,null,null,null,"Jalisco","14","Jocotepec","050"]
[null,null,null,null,null,null,null,null,null,"Jalisco","14","Juanacatlán","051"]
[null,null,null,null,null,null,null,null,null,"Jalisco","14","Juchitlán","052"]
[null,null,null,null,null,null,null,null,null,"Jalisco","14","Lagos de Moreno","053"]
[null,null,null,null,null,null,null,null,null,"Jalisco","14","El Limón","054"]
[null,null,null,null,null,null,null,null,null,"Jalisco","14","Magdalena","055"]
[null,null,null,null,null,null,null,null,null,"Jalisco","14","Santa María del Oro","056"]
[null,null,null,null,null,null,null,null,null,"Jalisco","14","La Manzanilla de la Paz","057"]
[null,null,null,null,null,null,null,null,null,"Jalisco","14","Mascota","058"]
[null,null,null,null,null,null,null,null,null,"Jalisco","14","Mazamitla","059"]
[null,null,null,null,null,null,null,null,null,"Jalisco","14","Mexticacán","060"]
[null,null,null,null,null,null,null,null,null,"Jalisco","14","Mezquitic","061"]
[null,null,null,null,null,null,null,null,null,"Jalisco","14","Mixtlán","062"]
[null,null,null,null,null,null,null,null,null,"Jalisco","14","Ocotlán","063"]
[null,null,null,null,null,null,null,null,null,"Jalisco","14","Ojuelos de Jalisco","064"]
[null,null,null,null,null,null,null,null,null,"Jalisco","14","Pihuamo","065"]
[null,null,null,null,null,null,null,null,null,"Jalisco","14","Poncitlán","066"]
[null,null,null,null,null,null,null,null,null,"Jalisco","14","Puerto Vallarta","067"]
[null,null,null,null,null,null,null,null,null,"Jalisco","14","Villa Purificación","068"]
[null,null,null,null,null,null,null,null,null,"Jalisco","14","Quitupan","069"]
[null,null,null,null,null,null,null,null,null,"Jalisco","14","El Salto","070"]
[null,null,null,null,null,null,null,null,null,"Jalisco","14","San Cristóbal de la Barranca","071"]
[null,null,null,null,null,null,null,null,null,"Jalisco","14","San Diego de Alejandría","072"]
[null,null,null,null,null,null,null,null,null,"Jalisco","14","San Juan de los Lagos","073"]
[null,null,null,null,null,null,null,null,null,"Jalisco","14","San Julián","074"]
[null,null,null,null,null,null,null,null,null,"Jalisco","14","San Marcos","075"]
[null,null,null,null,null,null,null,null,null,"Jalisco","14","San Martín de Bolaños","076"]
[null,null,null,null,null,null,null,null,null,"Jalisco","14","San Martín Hidalgo","077"]
[null,null,null,null,null,null,null,null,null,"Jalisco","14","San Miguel el Alto","078"]
[null,null,null,null,null,null,null,null,null,"Jalisco","14","Gómez Farías","079"]
[null,null,null,null,null,null,null,null,null,"Jalisco","14","San Sebastián del Oeste","080"]
[null,null,null,null,null,null,null,null,null,"Jalisco","14","Santa María de los Ángeles","081"]
[null,null,null,null,null,null,null,null,null,"Jalisco","14","Sayula","082"]
[null,null,null,null,null,null,null,null,null,"Jalisco","14","Tala","083"]
[null,null,null,null,null,null,null,null,null,"Jalisco","14","Talpa de Allende","084"]
[null,null,null,null,null,null,null,null,null,"Jalisco","14","Tamazula de Gordiano","085"]
[null,null,null,null,null,null,null,null,null,"Jalisco","14","Tapalpa","086"]
[null,null,null,null,null,null,null,null,null,"Jalisco","14","Tecalitlán","087"]
[null,null,null,null,null,null,null,null,null,"Jalisco","14","Tecolotlán","088"]
[null,null,null,null,null,null,null,null,null,"Jalisco","14","Techaluta de Montenegro","089"]
[null,null,null,null,null,null,null,null,null,"Jalisco","14","Tenamaxtlán","090"]
[null,null,null,null,null,null,null,null,null,"Jalisco","14","Teocaltiche","091"]
[null,null,null,null,null,null,null,null,null,"Jalisco","14","Teocuitatlán de Corona","092"]
[null,null,null,null,null,null,null,null,null,"Jalisco","14","Tepatitlán de Morelos","093"]
[null,null,null,null,null,null,null,null,null,"Jalisco","14","Tequila","094"]
[null,null,null,null,null,null,null,null,null,"Jalisco","14","Teuchitlán","095"]
[null,null,null,null,null,null,null,null,null,"Jalisco","14","Tizapán el Alto","096"]
[null,null,null,null,null,null,null,null,null,"Jalisco","14","Tlajomulco de Zúñiga","097"]
[null,null,null,null,null,null,null,null,null,"Jalisco","14","San Pedro Tlaquepaque","098"]
[null,null,null,null,null,null,null,null,null,"Jalisco","14","Tolimán","099"]
[null,null,null,null,null,null,null,null,null,"Jalisco","14","Tomatlán","100"]
[null,null,null,null,null,null,null,null,null,"Jalisco","14","Tonalá","101"]
[null,null,null,null,null,null,null,null,null,"Jalisco","14","Tonaya","102"]
[null,null,null,null,null,null,null,null,null,"Jalisco","14","Tonila","103"]
[null,null,null,null,null,null,null,null,null,"Jalisco","14","Totatiche","104"]
[null,null,null,null,null,null,null,null,null,"Jalisco","14","Tototlán","105"]
[null,null,null,null,null,null,null,null,null,"Jalisco","14","Tuxcacuesco","106"]
[null,null,null,null,null,null,null,null,null,"Jalisco","14","Tuxcueca","107"]
[null,null,null,null,null,null,null,null,null,"Jalisco","14","Tuxpan","108"]
[null,null,null,null,null,null,null,null,null,"Jalisco","14","Unión de San Antonio","109"]
[null,null,null,null,null,null,null,null,null,"Jalisco","14","Unión de Tula","110"]
[null,null,null,null,null,null,null,null,null,"Jalisco","14","Valle de Guadalupe","111"]
[null,null,null,null,null,null,null,null,null,"Jalisco","14","Valle de Juárez","112"]
[null,null,null,null,null,null,null,null,null,"Jalisco","14","San Gabriel","113"]
[null,null,null,null,null,null,null,null,null,"Jalisco","14","Villa Corona","114"]
[null,null,null,null,null,null,null,null,null,"Jalisco","14","Villa Guerrero","115"]
[null,null,null,null,null,null,null,null,null,"Jalisco","14","Villa Hidalgo","116"]
[null,null,null,null,null,null,null,null,null,"Jalisco","14","Cañadas de Obregón","117"]
[null,null,null,null,null,null,null,null,null,"Jalisco","14","Yahualica de González Gallo","118"]
[null,null,null,null,null,null,null,null,null,"Jalisco","14","Zacoalco de Torres","119"]
[null,null,null,null,null,null,null,null,null,"Jalisco","14","Zapopan","120"]
[null,null,null,null,null,null,null,null,null,"Jalisco","14","Zapotiltic","121"]
[null,null,null,null,null,null,null,null,null,"Jalisco","14","Zapotitlán de Vadillo","122"]
[null,null,null,null,null,null,null,null,null,"Jalisco","14","Zapotlán del Rey","123"]
[null,null,null,null,null,null,null,null,null,"Jalisco","14","Zapotlanejo","124"]
[null,null,null,null,null,null,null,null,null,"Jalisco","14","San Ignacio Cerro Gordo","125"]
[null,null,null,null,null,null,null,null,null,"México","15","Acambay de Ruíz Castañeda","001"]
[null,null,null,null,null,null,null,null,null,"México","15","Acolman","002"]
[null,null,null,null,null,null,null,null,null,"México","15","Aculco","003"]
[null,null,null,null,null,null,null,null,null,"México","15","Almoloya de Alquisiras","004"]
[null,null,null,null,null,null,null,null,null,"México","15","Almoloya de Juárez","005"]
[null,null,null,null,null,null,null,null,null,"México","15","Almoloya del Río","006"]
[null,null,null,null,null,null,null,null,null,"México","15","Amanalco","007"]
[null,null,null,null,null,null,null,null,null,"México","15","Amatepec","008"]
[null,null,null,null,null,null,null,null,null,"México","15","Amecameca","009"]
[null,null,null,null,null,null,null,null,null,"México","15","Apaxco","010"]
[null,null,null,null,null,null,null,null,null,"México","15","Atenco","011"]
[null,null,null,null,null,null,null,null,null,"México","15","Atizapán","012"]
[null,null,null,null,null,null,null,null,null,"México","15","Atizapán de Zaragoza","013"]
[null,null,null,null,null,null,null,null,null,"México","15","Atlacomulco","014"]
[null,null,null,null,null,null,null,null,null,"México","15","Atlautla","015"]
[null,null,null,null,null,null,null,null,null,"México","15","Axapusco","016"]
[null,null,null,null,null,null,null,null,null,"México","15","Ayapango","017"]
[null,null,null,null,null,null,null,null,null,"México","15","Calimaya","018"]
[null,null,null,null,null,null,null,null,null,"México","15","Capulhuac","019"]
[null,null,null,null,null,null,null,null,null,"México","15","Coacalco de Berriozábal","020"]
[null,null,null,null,null,null,null,null,null,"México","15","Coatepec Harinas","021"]
[null,null,null,null,null,null,null,null,null,"México","15","Cocotitlán","022"]
[null,null,null,null,null,null,null,null,null,"México","15","Coyotepec","023"]
[null,null,null,null,null,null,null,null,null,"México","15","Cuautitlán","024"]
[null,null,null,null,null,null,null,null,null,"México","15","Chalco","025"]
[null,null,null,null,null,null,null,null,null,"México","15","Chapa de Mota","026"]
[null,null,null,null,null,null,null,null,null,"México","15","Chapultepec","027"]
[null,null,null,null,null,null,null,null,null,"México","15","Chiautla","028"]
[null,null,null,null,null,null,null,null,null,"México","15","Chicoloapan","029"]
[null,null,null,null,null,null,null,null,null,"México","15","Chiconcuac","030"]
[null,null,null,null,null,null,null,null,null,"México","15","Chimalhuacán","031"]
[null,null,null,null,null,null,null,null,null,"México","15","Donato Guerra","032"]
[null,null,null,null,null,null,null,null,null,"México","15","Ecatepec de Morelos","033"]
[null,null,null,null,null,null,null,null,null,"México","15","Ecatzingo","034"]
[null,null,null,null,null,null,null,null,null,"México","15","Huehuetoca","035"]
[null,null,null,null,null,null,null,null,null,"México","15","Hueypoxtla","036"]
[null,null,null,null,null,null,null,null,null,"México","15","Huixquilucan","037"]
[null,null,null,null,null,null,null,null,null,"México","15","Isidro Fabela","038"]
[null,null,null,null,null,null,null,null,null,"México","15","Ixtapaluca","039"]
[null,null,null,null,null,null,null,null,null,"México","15","Ixtapan de la Sal","040"]
[null,null,null,null,null,null,null,null,null,"México","15","Ixtapan del Oro","041"]
[null,null,null,null,null,null,null,null,null,"México","15","Ixtlahuaca","042"]
[null,null,null,null,null,null,null,null,null,"México","15","Xalatlaco","043"]
[null,null,null,null,null,null,null,null,null,"México","15","Jaltenco","044"]
[null,null,null,null,null,null,null,null,null,"México","15","Jilotepec","045"]
[null,null,null,null,null,null,null,null,null,"México","15","Jilotzingo","046"]
[null,null,null,null,null,null,null,null,null,"México","15","Jiquipilco","047"]
[null,null,null,null,null,null,null,null,null,"México","15","Jocotitlán","048"]
[null,null,null,null,null,null,null,null,null,"México","15","Joquicingo","049"]
[null,null,null,null,null,null,null,null,null,"México","15","Juchitepec","050"]
[null,null,null,null,null,null,null,null,null,"México","15","Lerma","051"]
[null,null,null,null,null,null,null,null,null,"México","15","Malinalco","052"]
[null,null,null,null,null,null,null,null,null,"México","15","Melchor Ocampo","053"]
[null,null,null,null,null,null,null,null,null,"México","15","Metepec","054"]
[null,null,null,null,null,null,null,null,null,"México","15","Mexicaltzingo","055"]
[null,null,null,null,null,null,null,null,null,"México","15","Morelos","056"]
[null,null,null,null,null,null,null,null,null,"México","15","Naucalpan de Juárez","057"]
[null,null,null,null,null,null,null,null,null,"México","15","Nezahualcóyotl","058"]
[null,null,null,null,null,null,null,null,null,"México","15","Nextlalpan","059"]
[null,null,null,null,null,null,null,null,null,"México","15","Nicolás Romero","060"]
[null,null,null,null,null,null,null,null,null,"México","15","Nopaltepec","061"]
[null,null,null,null,null,null,null,null,null,"México","15","Ocoyoacac","062"]
[null,null,null,null,null,null,null,null,null,"México","15","Ocuilan","063"]
[null,null,null,null,null,null,null,null,null,"México","15","El Oro","064"]
[null,null,null,null,null,null,null,null,null,"México","15","Otumba","065"]
[null,null,null,null,null,null,null,null,null,"México","15","Otzoloapan","066"]
[null,null,null,null,null,null,null,null,null,"México","15","Otzolotepec","067"]
[null,null,null,null,null,null,null,null,null,"México","15","Ozumba","068"]
[null,null,null,null,null,null,null,null,null,"México","15","Papalotla","069"]
[null,null,null,null,null,null,null,null,null,"México","15","La Paz","070"]
[null,null,null,null,null,null,null,null,null,"México","15","Polotitlán","071"]
[null,null,null,null,null,null,null,null,null,"México","15","Rayón","072"]
[null,null,null,null,null,null,null,null,null,"México","15","San Antonio la Isla","073"]
[null,null,null,null,null,null,null,null,null,"México","15","San Felipe del Progreso","074"]
[null,null,null,null,null,null,null,null,null,"México","15","San Martín de las Pirámides","075"]
[null,null,null,null,null,null,null,null,null,"México","15","San Mateo Atenco","076"]
[null,null,null,null,null,null,null,null,null,"México","15","San Simón de Guerrero","077"]
[null,null,null,null,null,null,null,null,null,"México","15","Santo Tomás","078"]
[null,null,null,null,null,null,null,null,null,"México","15","Soyaniquilpan de Juárez","079"]
[null,null,null,null,null,null,null,null,null,"México","15","Sultepec","080"]
[null,null,null,null,null,null,null,null,null,"México","15","Tecámac","081"]
[null,null,null,null,null,null,null,null,null,"México","15","Tejupilco","082"]
[null,null,null,null,null,null,null,null,null,"México","15","Temamatla","083"]
[null,null,null,null,null,null,null,null,null,"México","15","Temascalapa","084"]
[null,null,null,null,null,null,null,null,null,"México","15","Temascalcingo","085"]
[null,null,null,null,null,null,null,null,null,"México","15","Temascaltepec","086"]
[null,null,null,null,null,null,null,null,null,"México","15","Temoaya","087"]
[null,null,null,null,null,null,null,null,null,"México","15","Tenancingo","088"]
[null,null,null,null,null,null,null,null,null,"México","15","Tenango del Aire","089"]
[null,null,null,null,null,null,null,null,null,"México","15","Tenango del Valle","090"]
[null,null,null,null,null,null,null,null,null,"México","15","Teoloyucan","091"]
[null,null,null,null,null,null,null,null,null,"México","15","Teotihuacán","092"]
[null,null,null,null,null,null,null,null,null,"México","15","Tepetlaoxtoc","093"]
[null,null,null,null,null,null,null,null,null,"México","15","Tepetlixpa","094"]
[null,null,null,null,null,null,null,null,null,"México","15","Tepotzotlán","095"]
[null,null,null,null,null,null,null,null,null,"México","15","Tequixquiac","096"]
[null,null,null,null,null,null,null,null,null,"México","15","Texcaltitlán","097"]
[null,null,null,null,null,null,null,null,null,"México","15","Texcalyacac","098"]
[null,null,null,null,null,null,null,null,null,"México","15","Texcoco","099"]
[null,null,null,null,null,null,null,null,null,"México","15","Tezoyuca","100"]
[null,null,null,null,null,null,null,null,null,"México","15","Tianguistenco","101"]
[null,null,null,null,null,null,null,null,null,"México","15","Timilpan","102"]
[null,null,null,null,null,null,null,null,null,"México","15","Tlalmanalco","103"]
[null,null,null,null,null,null,null,null,null,"México","15","Tlalnepantla de Baz","104"]
[null,null,null,null,null,null,null,null,null,"México","15","Tlatlaya","105"]
[null,null,null,null,null,null,null,null,null,"México","15","Toluca","106"]
[null,null,null,null,null,null,null,null,null,"México","15","Tonatico","107"]
[null,null,null,null,null,null,null,null,null,"México","15","Tultepec","108"]
[null,null,null,null,null,null,null,null,null,"México","15","Tultitlán","109"]
[null,null,null,null,null,null,null,null,null,"México","15","Valle de Bravo","110"]
[null,null,null,null,null,null,null,null,null,"México","15","Villa de Allende","111"]
[null,null,null,null,null,null,null,null,null,"México","15","Villa del Carbón","112"]
[null,null,null,null,null,null,null,null,null,"México","15","Villa Guerrero","113"]
[null,null,null,null,null,null,null,null,null,"México","15","Villa Victoria","114"]
[null,null,null,null,null,null,null,null,null,"México","15","Xonacatlán","115"]
[null,null,null,null,null,null,null,null,null,"México","15","Zacazonapan","116"]
[null,null,null,null,null,null,null,null,null,"México","15","Zacualpan","117"]
[null,null,null,null,null,null,null,null,null,"México","15","Zinacantepec","118"]
[null,null,null,null,null,null,null,null,null,"México","15","Zumpahuacán","119"]
[null,null,null,null,null,null,null,null,null,"México","15","Zumpango","120"]
[null,null,null,null,null,null,null,null,null,"México","15","Cuautitlán Izcalli","121"]
[null,null,null,null,null,null,null,null,null,"México","15","Valle de Chalco Solidaridad","122"]
[null,null,null,null,null,null,null,null,null,"México","15","Luvianos","123"]
[null,null,null,null,null,null,null,null,null,"México","15","San José del Rincón","124"]
[null,null,null,null,null,null,null,null,null,"México","15","Tonanitla","125"]
[null,null,null,null,null,null,null,null,null,"Michoacán de Ocampo","16","Acuitzio","001"]
[null,null,null,null,null,null,null,null,null,"Michoacán de Ocampo","16","Aguililla","002"]
[null,null,null,null,null,null,null,null,null,"Michoacán de Ocampo","16","Álvaro Obregón","003"]
[null,null,null,null,null,null,null,null,null,"Michoacán de Ocampo","16","Angamacutiro","004"]
[null,null,null,null,null,null,null,null,null,"Michoacán de Ocampo","16","Angangueo","005"]
[null,null,null,null,null,null,null,null,null,"Michoacán de Ocampo","16","Apatzingán","006"]
[null,null,null,null,null,null,null,null,null,"Michoacán de Ocampo","16","Aporo","007"]
[null,null,null,null,null,null,null,null,null,"Michoacán de Ocampo","16","Aquila","008"]
[null,null,null,null,null,null,null,null,null,"Michoacán de Ocampo","16","Ario","009"]
[null,null,null,null,null,null,null,null,null,"Michoacán de Ocampo","16","Arteaga","010"]
[null,null,null,null,null,null,null,null,null,"Michoacán de Ocampo","16","Briseñas","011"]
[null,null,null,null,null,null,null,null,null,"Michoacán de Ocampo","16","Buenavista","012"]
[null,null,null,null,null,null,null,null,null,"Michoacán de Ocampo","16","Carácuaro","013"]
[null,null,null,null,null,null,null,null,null,"Michoacán de Ocampo","16","Coahuayana","014"]
[null,null,null,null,null,null,null,null,null,"Michoacán de Ocampo","16","Coalcomán de Vázquez Pallares","015"]
[null,null,null,null,null,null,null,null,null,"Michoacán de Ocampo","16","Coeneo","016"]
[null,null,null,null,null,null,null,null,null,"Michoacán de Ocampo","16","Contepec","017"]
[null,null,null,null,null,null,null,null,null,"Michoacán de Ocampo","16","Copándaro","018"]
[null,null,null,null,null,null,null,null,null,"Michoacán de Ocampo","16","Cotija","019"]
[null,null,null,null,null,null,null,null,null,"Michoacán de Ocampo","16","Cuitzeo","020"]
[null,null,null,null,null,null,null,null,null,"Michoacán de Ocampo","16","Charapan","021"]
[null,null,null,null,null,null,null,null,null,"Michoacán de Ocampo","16","Charo","022"]
[null,null,null,null,null,null,null,null,null,"Michoacán de Ocampo","16","Chavinda","023"]
[null,null,null,null,null,null,null,null,null,"Michoacán de Ocampo","16","Cherán","024"]
[null,null,null,null,null,null,null,null,null,"Michoacán de Ocampo","16","Chilchota","025"]
[null,null,null,null,null,null,null,null,null,"Michoacán de Ocampo","16","Chinicuila","026"]
[null,null,null,null,null,null,null,null,null,"Michoacán de Ocampo","16","Chucándiro","027"]
[null,null,null,null,null,null,null,null,null,"Michoacán de Ocampo","16","Churintzio","028"]
[null,null,null,null,null,null,null,null,null,"Michoacán de Ocampo","16","Churumuco","029"]
[null,null,null,null,null,null,null,null,null,"Michoacán de Ocampo","16","Ecuandureo","030"]
[null,null,null,null,null,null,null,null,null,"Michoacán de Ocampo","16","Epitacio Huerta","031"]
[null,null,null,null,null,null,null,null,null,"Michoacán de Ocampo","16","Erongarícuaro","032"]
[null,null,null,null,null,null,null,null,null,"Michoacán de Ocampo","16","Gabriel Zamora","033"]
[null,null,null,null,null,null,null,null,null,"Michoacán de Ocampo","16","Hidalgo","034"]
[null,null,null,null,null,null,null,null,null,"Michoacán de Ocampo","16","La Huacana","035"]
[null,null,null,null,null,null,null,null,null,"Michoacán de Ocampo","16","Huandacareo","036"]
[null,null,null,null,null,null,null,null,null,"Michoacán de Ocampo","16","Huaniqueo","037"]
[null,null,null,null,null,null,null,null,null,"Michoacán de Ocampo","16","Huetamo","038"]
[null,null,null,null,null,null,null,null,null,"Michoacán de Ocampo","16","Huiramba","039"]
[null,null,null,null,null,null,null,null,null,"Michoacán de Ocampo","16","Indaparapeo","040"]
[null,null,null,null,null,null,null,null,null,"Michoacán de Ocampo","16","Irimbo","041"]
[null,null,null,null,null,null,null,null,null,"Michoacán de Ocampo","16","Ixtlán","042"]
[null,null,null,null,null,null,null,null,null,"Michoacán de Ocampo","16","Jacona","043"]
[null,null,null,null,null,null,null,null,null,"Michoacán de Ocampo","16","Jiménez","044"]
[null,null,null,null,null,null,null,null,null,"Michoacán de Ocampo","16","Jiquilpan","045"]
[null,null,null,null,null,null,null,null,null,"Michoacán de Ocampo","16","Juárez","046"]
[null,null,null,null,null,null,null,null,null,"Michoacán de Ocampo","16","Jungapeo","047"]
[null,null,null,null,null,null,null,null,null,"Michoacán de Ocampo","16","Lagunillas","048"]
[null,null,null,null,null,null,null,null,null,"Michoacán de Ocampo","16","Madero","049"]
[null,null,null,null,null,null,null,null,null,"Michoacán de Ocampo","16","Maravatío","050"]
[null,null,null,null,null,null,null,null,null,"Michoacán de Ocampo","16","Marcos Castellanos","051"]
[null,null,null,null,null,null,null,null,null,"Michoacán de Ocampo","16","Lázaro Cárdenas","052"]
[null,null,null,null,null,null,null,null,null,"Michoacán de Ocampo","16","Morelia","053"]
[null,null,null,null,null,null,null,null,null,"Michoacán de Ocampo","16","Morelos","054"]
[null,null,null,null,null,null,null,null,null,"Michoacán de Ocampo","16","Múgica","055"]
[null,null,null,null,null,null,null,null,null,"Michoacán de Ocampo","16","Nahuatzen","056"]
[null,null,null,null,null,null,null,null,null,"Michoacán de Ocampo","16","Nocupétaro","057"]
[null,null,null,null,null,null,null,null,null,"Michoacán de Ocampo","16","Nuevo Parangaricutiro","058"]
[null,null,null,null,null,null,null,null,null,"Michoacán de Ocampo","16","Nuevo Urecho","059"]
[null,null,null,null,null,null,null,null,null,"Michoacán de Ocampo","16","Numarán","060"]
[null,null,null,null,null,null,null,null,null,"Michoacán de Ocampo","16","Ocampo","061"]
[null,null,null,null,null,null,null,null,null,"Michoacán de Ocampo","16","Pajacuarán","062"]
[null,null,null,null,null,null,null,null,null,"Michoacán de Ocampo","16","Panindícuaro","063"]
[null,null,null,null,null,null,null,null,null,"Michoacán de Ocampo","16","Parácuaro","064"]
[null,null,null,null,null,null,null,null,null,"Michoacán de Ocampo","16","Paracho","065"]
[null,null,null,null,null,null,null,null,null,"Michoacán de Ocampo","16","Pátzcuaro","066"]
[null,null,null,null,null,null,null,null,null,"Michoacán de Ocampo","16","Penjamillo","067"]
[null,null,null,null,null,null,null,null,null,"Michoacán de Ocampo","16","Peribán","068"]
[null,null,null,null,null,null,null,null,null,"Michoacán de Ocampo","16","La Piedad","069"]
[null,null,null,null,null,null,null,null,null,"Michoacán de Ocampo","16","Purépero","070"]
[null,null,null,null,null,null,null,null,null,"Michoacán de Ocampo","16","Puruándiro","071"]
[null,null,null,null,null,null,null,null,null,"Michoacán de Ocampo","16","Queréndaro","072"]
[null,null,null,null,null,null,null,null,null,"Michoacán de Ocampo","16","Quiroga","073"]
[null,null,null,null,null,null,null,null,null,"Michoacán de Ocampo","16","Cojumatlán de Régules","074"]
[null,null,null,null,null,null,null,null,null,"Michoacán de Ocampo","16","Los Reyes","075"]
[null,null,null,null,null,null,null,null,null,"Michoacán de Ocampo","16","Sahuayo","076"]
[null,null,null,null,null,null,null,null,null,"Michoacán de Ocampo","16","San Lucas","077"]
[null,null,null,null,null,null,null,null,null,"Michoacán de Ocampo","16","Santa Ana Maya","078"]
[null,null,null,null,null,null,null,null,null,"Michoacán de Ocampo","16","Salvador Escalante","079"]
[null,null,null,null,null,null,null,null,null,"Michoacán de Ocampo","16","Senguio","080"]
[null,null,null,null,null,null,null,null,null,"Michoacán de Ocampo","16","Susupuato","081"]
[null,null,null,null,null,null,null,null,null,"Michoacán de Ocampo","16","Tacámbaro","082"]
[null,null,null,null,null,null,null,null,null,"Michoacán de Ocampo","16","Tancítaro","083"]
[null,null,null,null,null,null,null,null,null,"Michoacán de Ocampo","16","Tangamandapio","084"]
[null,null,null,null,null,null,null,null,null,"Michoacán de Ocampo","16","Tangancícuaro","085"]
[null,null,null,null,null,null,null,null,null,"Michoacán de Ocampo","16","Tanhuato","086"]
[null,null,null,null,null,null,null,null,null,"Michoacán de Ocampo","16","Taretan","087"]
[null,null,null,null,null,null,null,null,null,"Michoacán de Ocampo","16","Tarímbaro","088"]
[null,null,null,null,null,null,null,null,null,"Michoacán de Ocampo","16","Tepalcatepec","089"]
[null,null,null,null,null,null,null,null,null,"Michoacán de Ocampo","16","Tingambato","090"]
[null,null,null,null,null,null,null,null,null,"Michoacán de Ocampo","16","Tingüindín","091"]
[null,null,null,null,null,null,null,null,null,"Michoacán de Ocampo","16","Tiquicheo de Nicolás Romero","092"]
[null,null,null,null,null,null,null,null,null,"Michoacán de Ocampo","16","Tlalpujahua","093"]
[null,null,null,null,null,null,null,null,null,"Michoacán de Ocampo","16","Tlazazalca","094"]
[null,null,null,null,null,null,null,null,null,"Michoacán de Ocampo","16","Tocumbo","095"]
[null,null,null,null,null,null,null,null,null,"Michoacán de Ocampo","16","Tumbiscatío","096"]
[null,null,null,null,null,null,null,null,null,"Michoacán de Ocampo","16","Turicato","097"]
[null,null,null,null,null,null,null,null,null,"Michoacán de Ocampo","16","Tuxpan","098"]
[null,null,null,null,null,null,null,null,null,"Michoacán de Ocampo","16","Tuzantla","099"]
[null,null,null,null,null,null,null,null,null,"Michoacán de Ocampo","16","Tzintzuntzan","100"]
[null,null,null,null,null,null,null,null,null,"Michoacán de Ocampo","16","Tzitzio","101"]
[null,null,null,null,null,null,null,null,null,"Michoacán de Ocampo","16","Uruapan","102"]
[null,null,null,null,null,null,null,null,null,"Michoacán de Ocampo","16","Venustiano Carranza","103"]
[null,null,null,null,null,null,null,null,null,"Michoacán de Ocampo","16","Villamar","104"]
[null,null,null,null,null,null,null,null,null,"Michoacán de Ocampo","16","Vista Hermosa","105"]
[null,null,null,null,null,null,null,null,null,"Michoacán de Ocampo","16","Yurécuaro","106"]
[null,null,null,null,null,null,null,null,null,"Michoacán de Ocampo","16","Zacapu","107"]
[null,null,null,null,null,null,null,null,null,"Michoacán de Ocampo","16","Zamora","108"]
[null,null,null,null,null,null,null,null,null,"Michoacán de Ocampo","16","Zináparo","109"]
[null,null,null,null,null,null,null,null,null,"Michoacán de Ocampo","16","Zinapécuaro","110"]
[null,null,null,null,null,null,null,null,null,"Michoacán de Ocampo","16","Ziracuaretiro","111"]
[null,null,null,null,null,null,null,null,null,"Michoacán de Ocampo","16","Zitácuaro","112"]
[null,null,null,null,null,null,null,null,null,"Michoacán de Ocampo","16","José Sixto Verduzco","113"]
[null,null,null,null,null,null,null,null,null,"Morelos","17","Amacuzac","001"]
[null,null,null,null,null,null,null,null,null,"Morelos","17","Atlatlahucan","002"]
[null,null,null,null,null,null,null,null,null,"Morelos","17","Axochiapan","003"]
[null,null,null,null,null,null,null,null,null,"Morelos","17","Ayala","004"]
[null,null,null,null,null,null,null,null,null,"Morelos","17","Coatlán del Río","005"]
[null,null,null,null,null,null,null,null,null,"Morelos","17","Cuautla","006"]
[null,null,null,null,null,null,null,null,null,"Morelos","17","Cuernavaca","007"]
[null,null,null,null,null,null,null,null,null,"Morelos","17","Emiliano Zapata","008"]
[null,null,null,null,null,null,null,null,null,"Morelos","17","Huitzilac","009"]
[null,null,null,null,null,null,null,null,null,"Morelos","17","Jantetelco","010"]
[null,null,null,null,null,null,null,null,null,"Morelos","17","Jiutepec","011"]
[null,null,null,null,null,null,null,null,null,"Morelos","17","Jojutla","012"]
[null,null,null,null,null,null,null,null,null,"Morelos","17","Jonacatepec de Leandro Valle","013"]
[null,null,null,null,null,null,null,null,null,"Morelos","17","Mazatepec","014"]
[null,null,null,null,null,null,null,null,null,"Morelos","17","Miacatlán","015"]
[null,null,null,null,null,null,null,null,null,"Morelos","17","Ocuituco","016"]
[null,null,null,null,null,null,null,null,null,"Morelos","17","Puente de Ixtla","017"]
[null,null,null,null,null,null,null,null,null,"Morelos","17","Temixco","018"]
[null,null,null,null,null,null,null,null,null,"Morelos","17","Tepalcingo","019"]
[null,null,null,null,null,null,null,null,null,"Morelos","17","Tepoztlán","020"]
[null,null,null,null,null,null,null,null,null,"Morelos","17","Tetecala","021"]
[null,null,null,null,null,null,null,null,null,"Morelos","17","Tetela del Volcán","022"]
[null,null,null,null,null,null,null,null,null,"Morelos","17","Tlalnepantla","023"]
[null,null,null,null,null,null,null,null,null,"Morelos","17","Tlaltizapán de Zapata","024"]
[null,null,null,null,null,null,null,null,null,"Morelos","17","Tlaquiltenango","025"]
[null,null,null,null,null,null,null,null,null,"Morelos","17","Tlayacapan","026"]
[null,null,null,null,null,null,null,null,null,"Morelos","17","Totolapan","027"]
[null,null,null,null,null,null,null,null,null,"Morelos","17","Xochitepec","028"]
[null,null,null,null,null,null,null,null,null,"Morelos","17","Yautepec","029"]
[null,null,null,null,null,null,null,null,null,"Morelos","17","Yecapixtla","030"]
[null,null,null,null,null,null,null,null,null,"Morelos","17","Zacatepec","031"]
[null,null,null,null,null,null,null,null,null,"Morelos","17","Zacualpan de Amilpas","032"]
[null,null,null,null,null,null,null,null,null,"Morelos","17","Temoac","033"]
[null,null,null,null,null,null,null,null,null,"Morelos","17","Coatetelco","034"]
[null,null,null,null,null,null,null,null,null,"Morelos","17","Xoxocotla","035"]
[null,null,null,null,null,null,null,null,null,"Morelos","17","Hueyapan","036"]
[null,null,null,null,null,null,null,null,null,"Nayarit","18","Acaponeta","001"]
[null,null,null,null,null,null,null,null,null,"Nayarit","18","Ahuacatlán","002"]
[null,null,null,null,null,null,null,null,null,"Nayarit","18","Amatlán de Cañas","003"]
[null,null,null,null,null,null,null,null,null,"Nayarit","18","Compostela","004"]
[null,null,null,null,null,null,null,null,null,"Nayarit","18","Huajicori","005"]
[null,null,null,null,null,null,null,null,null,"Nayarit","18","Ixtlán del Río","006"]
[null,null,null,null,null,null,null,null,null,"Nayarit","18","Jala","007"]
[null,null,null,null,null,null,null,null,null,"Nayarit","18","Xalisco","008"]
[null,null,null,null,null,null,null,null,null,"Nayarit","18","Del Nayar","009"]
[null,null,null,null,null,null,null,null,null,"Nayarit","18","Rosamorada","010"]
[null,null,null,null,null,null,null,null,null,"Nayarit","18","Ruíz","011"]
[null,null,null,null,null,null,null,null,null,"Nayarit","18","San Blas","012"]
[null,null,null,null,null,null,null,null,null,"Nayarit","18","San Pedro Lagunillas","013"]
[null,null,null,null,null,null,null,null,null,"Nayarit","18","Santa María del Oro","014"]
[null,null,null,null,null,null,null,null,null,"Nayarit","18","Santiago Ixcuintla","015"]
[null,null,null,null,null,null,null,null,null,"Nayarit","18","Tecuala","016"]
[null,null,null,null,null,null,null,null,null,"Nayarit","18","Tepic","017"]
[null,null,null,null,null,null,null,null,null,"Nayarit","18","Tuxpan","018"]
[null,null,null,null,null,null,null,null,null,"Nayarit","18","La Yesca","019"]
[null,null,null,null,null,null,null,null,null,"Nayarit","18","Bahía de Banderas","020"]
[null,null,null,null,null,null,null,null,null,"Nuevo León","19","Abasolo","001"]
[null,null,null,null,null,null,null,null,null,"Nuevo León","19","Agualeguas","002"]
[null,null,null,null,null,null,null,null,null,"Nuevo León","19","Los Aldamas","003"]
[null,null,null,null,null,null,null,null,null,"Nuevo León","19","Allende","004"]
[null,null,null,null,null,null,null,null,null,"Nuevo León","19","Anáhuac","005"]
[null,null,null,null,null,null,null,null,null,"Nuevo León","19","Apodaca","006"]
[null,null,null,null,null,null,null,null,null,"Nuevo León","19","Aramberri","007"]
[null,null,null,null,null,null,null,null,null,"Nuevo León","19","Bustamante","008"]
[null,null,null,null,null,null,null,null,null,"Nuevo León","19","Cadereyta Jiménez","009"]
[null,null,null,null,null,null,null,null,null,"Nuevo León","19","El Carmen","010"]
[null,null,null,null,null,null,null,null,null,"Nuevo León","19","Cerralvo","011"]
[null,null,null,null,null,null,null,null,null,"Nuevo León","19","Ciénega de Flores","012"]
[null,null,null,null,null,null,null,null,null,"Nuevo León","19","China","013"]
[null,null,null,null,null,null,null,null,null,"Nuevo León","19","Doctor Arroyo","014"]
[null,null,null,null,null,null,null,null,null,"Nuevo León","19","Doctor Coss","015"]
[null,null,null,null,null,null,null,null,null,"Nuevo León","19","Doctor González","016"]
[null,null,null,null,null,null,null,null,null,"Nuevo León","19","Galeana","017"]
[null,null,null,null,null,null,null,null,null,"Nuevo León","19","García","018"]
[null,null,null,null,null,null,null,null,null,"Nuevo León","19","San Pedro Garza García","019"]
[null,null,null,null,null,null,null,null,null,"Nuevo León","19","General Bravo","020"]
[null,null,null,null,null,null,null,null,null,"Nuevo León","19","General Escobedo","021"]
[null,null,null,null,null,null,null,null,null,"Nuevo León","19","General Terán","022"]
[null,null,null,null,null,null,null,null,null,"Nuevo León","19","General Treviño","023"]
[null,null,null,null,null,null,null,null,null,"Nuevo León","19","General Zaragoza","024"]
[null,null,null,null,null,null,null,null,null,"Nuevo León","19","General Zuazua","025"]
[null,null,null,null,null,null,null,null,null,"Nuevo León","19","Guadalupe","026"]
[null,null,null,null,null,null,null,null,null,"Nuevo León","19","Los Herreras","027"]
[null,null,null,null,null,null,null,null,null,"Nuevo León","19","Higueras","028"]
[null,null,null,null,null,null,null,null,null,"Nuevo León","19","Hualahuises","029"]
[null,null,null,null,null,null,null,null,null,"Nuevo León","19","Iturbide","030"]
[null,null,null,null,null,null,null,null,null,"Nuevo León","19","Juárez","031"]
[null,null,null,null,null,null,null,null,null,"Nuevo León","19","Lampazos de Naranjo","032"]
[null,null,null,null,null,null,null,null,null,"Nuevo León","19","Linares","033"]
[null,null,null,null,null,null,null,null,null,"Nuevo León","19","Marín","034"]
[null,null,null,null,null,null,null,null,null,"Nuevo León","19","Melchor Ocampo","035"]
[null,null,null,null,null,null,null,null,null,"Nuevo León","19","Mier y Noriega","036"]
[null,null,null,null,null,null,null,null,null,"Nuevo León","19","Mina","037"]
[null,null,null,null,null,null,null,null,null,"Nuevo León","19","Montemorelos","038"]
[null,null,null,null,null,null,null,null,null,"Nuevo León","19","Monterrey","039"]
[null,null,null,null,null,null,null,null,1,"Nuevo León","19","Parás","040"]
[null,null,null,null,null,null,null,null,2,"Nuevo León","19","Pesquería","041"]
[null,null,null,null,null,null,null,null,3,"Nuevo León","19","Los Ramones","042"]
[null,null,null,null,null,null,null,null,4,"Nuevo León","19","Rayones","043"]
[null,null,null,null,null,null,null,null,5,"Nuevo León","19","Sabinas Hidalgo","044"]
[null,null,null,null,null,null,null,null,6,"Nuevo León","19","Salinas Victoria","045"]
[null,null,null,null,null,null,null,null,7,"Nuevo León","19","San Nicolás de los Garza","046"]
[null,null,null,null,null,null,null,null,8,"Nuevo León","19","Hidalgo","047"]
[null,null,null,null,null,null,null,null,9,"Nuevo León","19","Santa Catarina","048"]
[null,null,null,null,null,null,null,null,10,"Nuevo León","19","Santiago","049"]
[null,null,null,null,null,null,null,null,11,"Nuevo León","19","Vallecillo","050"]
[null,null,null,null,null,null,null,null,12,"Nuevo León","19","Villaldama","051"]
[null,null,null,null,null,null,null,null,13,"Oaxaca","20","Abejones","001"]
[null,null,null,null,null,null,null,null,14,"Oaxaca","20","Acatlán de Pérez Figueroa","002"]
[null,null,null,null,null,null,null,null,15,"Oaxaca","20","Asunción Cacalotepec","003"]
[null,null,null,null,null,null,null,null,16,"Oaxaca","20","Asunción Cuyotepeji","004"]
[null,null,null,null,null,null,null,null,17,"Oaxaca","20","Asunción Ixtaltepec","005"]
[null,null,null,null,null,null,null,null,18,"Oaxaca","20","Asunción Nochixtlán","006"]
[null,null,null,null,null,null,null,null,19,"Oaxaca","20","Asunción Ocotlán","007"]
[null,null,null,null,null,null,null,null,20,"Oaxaca","20","Asunción Tlacolulita","008"]
[null,null,null,null,null,null,null,null,21,"Oaxaca","20","Ayotzintepec","009"]
[null,null,null,null,null,null,null,null,22,"Oaxaca","20","El Barrio de la Soledad","010"]
[null,null,null,null,null,null,null,null,23,"Oaxaca","20","Calihualá","011"]
[null,null,null,null,null,null,null,null,24,"Oaxaca","20","Candelaria Loxicha","012"]
[null,null,null,null,null,null,null,null,25,"Oaxaca","20","Ciénega de Zimatlán","013"]
[null,null,null,null,null,null,null,null,26,"Oaxaca","20","Ciudad Ixtepec","014"]
[null,null,null,null,null,null,null,null,27,"Oaxaca","20","Coatecas Altas","015"]
[null,null,null,null,null,null,null,null,28,"Oaxaca","20","Coicoyán de las Flores","016"]
[null,null,null,null,null,null,null,null,29,"Oaxaca","20","La Compañía","017"]
[null,null,null,null,null,null,null,null,30,"Oaxaca","20","Concepción Buenavista","018"]
[null,null,null,null,null,null,null,null,31,"Oaxaca","20","Concepción Pápalo","019"]
[null,null,null,null,null,null,null,null,32,"Oaxaca","20","Constancia del Rosario","020"]
[null,null,null,null,null,null,null,null,33,"Oaxaca","20","Cosolapa","021"]
[null,null,null,null,null,null,null,null,34,"Oaxaca","20","Cosoltepec","022"]
[null,null,null,null,null,null,null,null,35,"Oaxaca","20","Cuilápam de Guerrero","023"]
[null,null,null,null,null,null,null,null,36,"Oaxaca","20","Cuyamecalco Villa de Zaragoza","024"]
[null,null,null,null,null,null,null,null,37,"Oaxaca","20","Chahuites","025"]
[null,null,null,null,null,null,null,null,38,"Oaxaca","20","Chalcatongo de Hidalgo","026"]
[null,null,null,null,null,null,null,null,39,"Oaxaca","20","Chiquihuitlán de Benito Juárez","027"]
[null,null,null,null,null,null,null,null,40,"Oaxaca","20","Heroica Ciudad de Ejutla de Crespo","028"]
[null,null,null,null,null,null,null,null,41,"Oaxaca","20","Eloxochitlán de Flores Magón","029"]
[null,null,null,null,null,null,null,null,42,"Oaxaca","20","El Espinal","030"]
[null,null,null,null,null,null,null,null,43,"Oaxaca","20","Tamazulápam del Espíritu Santo","031"]
[null,null,null,null,null,null,null,null,44,"Oaxaca","20","Fresnillo de Trujano","032"]
[null,null,null,null,null,null,null,null,45,"Oaxaca","20","Guadalupe Etla","033"]
[null,null,null,null,null,null,null,null,46,"Oaxaca","20","Guadalupe de Ramírez","034"]
[null,null,null,null,null,null,null,null,47,"Oaxaca","20","Guelatao de Juárez","035"]
[null,null,null,null,null,null,null,null,48,"Oaxaca","20","Guevea de Humboldt","036"]
[null,null,null,null,null,null,null,null,49,"Oaxaca","20","Mesones Hidalgo","037"]
[null,null,null,null,null,null,null,null,50,"Oaxaca","20","Villa Hidalgo","038"]
[null,null,null,null,null,null,null,null,51,"Oaxaca","20","Heroica Ciudad de Huajuapan de León","039"]
[null,null,null,null,null,null,null,null,52,"Oaxaca","20","Huautepec","040"]
[null,null,null,null,null,null,null,null,53,"Oaxaca","20","Huautla de Jiménez","041"]
[null,null,null,null,null,null,null,null,54,"Oaxaca","20","Ixtlán de Juárez","042"]
[null,null,null,null,null,null,null,null,55,"Oaxaca","20","Juchitán de Zaragoza","043"]
[null,null,null,null,null,null,null,null,56,"Oaxaca","20","Loma Bonita","044"]
[null,null,null,null,null,null,null,null,57,"Oaxaca","20","Magdalena Apasco","045"]
[null,null,null,null,null,null,null,null,58,"Oaxaca","20","Magdalena Jaltepec","046"]
[null,null,null,null,null,null,null,null,59,"Oaxaca","20","Santa Magdalena Jicotlán","047"]
[null,null,null,null,null,null,null,null,60,"Oaxaca","20","Magdalena Mixtepec","048"]
[null,null,null,null,null,null,null,null,61,"Oaxaca","20","Magdalena Ocotlán","049"]
[null,null,null,null,null,null,null,null,62,"Oaxaca","20","Magdalena Peñasco","050"]
[null,null,null,null,null,null,null,null,63,"Oaxaca","20","Magdalena Teitipac","051"]
[null,null,null,null,null,null,null,null,64,"Oaxaca","20","Magdalena Tequisistlán","052"]
[null,null,null,null,null,null,null,null,65,"Oaxaca","20","Magdalena Tlacotepec","053"]
[null,null,null,null,null,null,null,null,66,"Oaxaca","20","Magdalena Zahuatlán","054"]
[null,null,null,null,null,null,null,null,67,"Oaxaca","20","Mariscala de Juárez","055"]
[null,null,null,null,null,null,null,null,68,"Oaxaca","20","Mártires de Tacubaya","056"]
[null,null,null,null,null,null,null,null,69,"Oaxaca","20","Matías Romero Avendaño","057"]
[null,null,null,null,null,null,null,null,70,"Oaxaca","20","Mazatlán Villa de Flores","058"]
[null,null,null,null,null,null,null,null,71,"Oaxaca","20","Miahuatlán de Porfirio Díaz","059"]
[null,null,null,null,null,null,null,null,72,"Oaxaca","20","Mixistlán de la Reforma","060"]
[null,null,null,null,null,null,null,null,73,"Oaxaca","20","Monjas","061"]
[null,null,null,null,null,null,null,null,74,"Oaxaca","20","Natividad","062"]
[null,null,null,null,null,null,null,null,75,"Oaxaca","20","Nazareno Etla","063"]
[null,null,null,null,null,null,null,null,76,"Oaxaca","20","Nejapa de Madero","064"]
[null,null,null,null,null,null,null,null,77,"Oaxaca","20","Ixpantepec Nieves","065"]
[null,null,null,null,null,null,null,null,78,"Oaxaca","20","Santiago Niltepec","066"]
[null,null,null,null,null,null,null,null,79,"Oaxaca","20","Oaxaca de Juárez","067"]
[null,null,null,null,null,null,null,null,80,"Oaxaca","20","Ocotlán de Morelos","068"]
[null,null,null,null,null,null,null,null,81,"Oaxaca","20","La Pe","069"]
[null,null,null,null,null,null,null,null,82,"Oaxaca","20","Pinotepa de Don Luis","070"]
[null,null,null,null,null,null,null,null,83,"Oaxaca","20","Pluma Hidalgo","071"]
[null,null,null,null,null,null,null,null,84,"Oaxaca","20","San José del Progreso","072"]
[null,null,null,null,null,null,null,null,85,"Oaxaca","20","Putla Villa de Guerrero","073"]
[null,null,null,null,null,null,null,null,86,"Oaxaca","20","Santa Catarina Quioquitani","074"]
[null,null,null,null,null,null,null,null,87,"Oaxaca","20","Reforma de Pineda","075"]
[null,null,null,null,null,null,null,null,88,"Oaxaca","20","La Reforma","076"]
[null,null,null,null,null,null,null,null,89,"Oaxaca","20","Reyes Etla","077"]
[null,null,null,null,null,null,null,null,90,"Oaxaca","20","Rojas de Cuauhtémoc","078"]
[null,null,null,null,null,null,null,null,91,"Oaxaca","20","Salina Cruz","079"]
[null,null,null,null,null,null,null,null,92,"Oaxaca","20","San Agustín Amatengo","080"]
[null,null,null,null,null,null,null,null,93,"Oaxaca","20","San Agustín Atenango","081"]
[null,null,null,null,null,null,null,null,94,"Oaxaca","20","San Agustín Chayuco","082"]
[null,null,null,null,null,null,null,null,95,"Oaxaca","20","San Agustín de las Juntas","083"]
[null,null,null,null,null,null,null,null,96,"Oaxaca","20","San Agustín Etla","084"]
[null,null,null,null,null,null,null,null,97,"Oaxaca","20","San Agustín Loxicha","085"]
[null,null,null,null,null,null,null,null,98,"Oaxaca","20","San Agustín Tlacotepec","086"]
[null,null,null,null,null,null,null,null,99,"Oaxaca","20","San Agustín Yatareni","087"]
[null,null,null,null,null,null,null,null,100,"Oaxaca","20","San Andrés Cabecera Nueva","088"]
[null,null,null,null,null,null,null,null,101,"Oaxaca","20","San Andrés Dinicuiti","089"]
[null,null,null,null,null,null,null,null,102,"Oaxaca","20","San Andrés Huaxpaltepec","090"]
[null,null,null,null,null,null,null,null,103,"Oaxaca","20","San Andrés Huayápam","091"]
[null,null,null,null,null,null,null,null,104,"Oaxaca","20","San Andrés Ixtlahuaca","092"]
[null,null,null,null,null,null,null,null,105,"Oaxaca","20","San Andrés Lagunas","093"]
[null,null,null,null,null,null,null,null,106,"Oaxaca","20","San Andrés Nuxiño","094"]
[null,null,null,null,null,null,null,null,107,"Oaxaca","20","San Andrés Paxtlán","095"]
[null,null,null,null,null,null,null,null,108,"Oaxaca","20","San Andrés Sinaxtla","096"]
[null,null,null,null,null,null,null,null,109,"Oaxaca","20","San Andrés Solaga","097"]
[null,null,null,null,null,null,null,null,110,"Oaxaca","20","San Andrés Teotilálpam","098"]
[null,null,null,null,null,null,null,null,111,"Oaxaca","20","San Andrés Tepetlapa","099"]
[null,null,null,null,null,null,null,null,112,"Oaxaca","20","San Andrés Yaá","100"]
[null,null,null,null,null,null,null,null,113,"Oaxaca","20","San Andrés Zabache","101"]
[null,null,null,null,null,null,null,null,114,"Oaxaca","20","San Andrés Zautla","102"]
[null,null,null,null,null,null,null,null,115,"Oaxaca","20","San Antonino Castillo Velasco","103"]
[null,null,null,null,null,null,null,null,116,"Oaxaca","20","San Antonino el Alto","104"]
[null,null,null,null,null,null,null,null,117,"Oaxaca","20","San Antonino Monte Verde","105"]
[null,null,null,null,null,null,null,null,118,"Oaxaca","20","San Antonio Acutla","106"]
[null,null,null,null,null,null,null,null,119,"Oaxaca","20","San Antonio de la Cal","107"]
[null,null,null,null,null,null,null,null,120,"Oaxaca","20","San Antonio Huitepec","108"]
[null,null,null,null,null,null,null,null,121,"Oaxaca","20","San Antonio Nanahuatípam","109"]
[null,null,null,null,null,null,null,null,122,"Oaxaca","20","San Antonio Sinicahua","110"]
[null,null,null,null,null,null,null,null,123,"Oaxaca","20","San Antonio Tepetlapa","111"]
[null,null,null,null,null,null,null,null,124,"Oaxaca","20","San Baltazar Chichicápam","112"]
[null,null,null,null,null,null,null,null,125,"Oaxaca","20","San Baltazar Loxicha","113"]
[null,null,null,null,null,null,null,null,126,"Oaxaca","20","San Baltazar Yatzachi el Bajo","114"]
[null,null,null,null,null,null,null,null,127,"Oaxaca","20","San Bartolo Coyotepec","115"]
[null,null,null,null,null,null,null,null,128,"Oaxaca","20","San Bartolomé Ayautla","116"]
[null,null,null,null,null,null,null,null,129,"Oaxaca","20","San Bartolomé Loxicha","117"]
[null,null,null,null,null,null,null,null,130,"Oaxaca","20","San Bartolomé Quialana","118"]
[null,null,null,null,null,null,null,null,131,"Oaxaca","20","San Bartolomé Yucuañe","119"]
[null,null,null,null,null,null,null,null,132,"Oaxaca","20","San Bartolomé Zoogocho","120"]
[null,null,null,null,null,null,null,null,133,"Oaxaca","20","San Bartolo Soyaltepec","121"]
[null,null,null,null,null,null,null,null,134,"Oaxaca","20","San Bartolo Yautepec","122"]
[null,null,null,null,null,null,null,null,135,"Oaxaca","20","San Bernardo Mixtepec","123"]
[null,null,null,null,null,null,null,null,136,"Oaxaca","20","San Blas Atempa","124"]
[null,null,null,null,null,null,null,null,137,"Oaxaca","20","San Carlos Yautepec","125"]
[null,null,null,null,null,null,null,null,138,"Oaxaca","20","San Cristóbal Amatlán","126"]
[null,null,null,null,null,null,null,null,139,"Oaxaca","20","San Cristóbal Amoltepec","127"]
[null,null,null,null,null,null,null,null,140,"Oaxaca","20","San Cristóbal Lachirioag","128"]
[null,null,null,null,null,null,null,null,141,"Oaxaca","20","San Cristóbal Suchixtlahuaca","129"]
[null,null,null,null,null,null,null,null,142,"Oaxaca","20","San Dionisio del Mar","130"]
[null,null,null,null,null,null,null,null,143,"Oaxaca","20","San Dionisio Ocotepec","131"]
[null,null,null,null,null,null,null,null,144,"Oaxaca","20","San Dionisio Ocotlán","132"]
[null,null,null,null,null,null,null,null,145,"Oaxaca","20","San Esteban Atatlahuca","133"]
[null,null,null,null,null,null,null,null,146,"Oaxaca","20","San Felipe Jalapa de Díaz","134"]
[null,null,null,null,null,null,null,null,147,"Oaxaca","20","San Felipe Tejalápam","135"]
[null,null,null,null,null,null,null,null,148,"Oaxaca","20","San Felipe Usila","136"]
[null,null,null,null,null,null,null,null,149,"Oaxaca","20","San Francisco Cahuacuá","137"]
[null,null,null,null,null,null,null,null,150,"Oaxaca","20","San Francisco Cajonos","138"]
[null,null,null,null,null,null,null,null,151,"Oaxaca","20","San Francisco Chapulapa","139"]
[null,null,null,null,null,null,null,null,152,"Oaxaca","20","San Francisco Chindúa","140"]
[null,null,null,null,null,null,null,null,153,"Oaxaca","20","San Francisco del Mar","141"]
[null,null,null,null,null,null,null,null,154,"Oaxaca","20","San Francisco Huehuetlán","142"]
[null,null,null,null,null,null,null,null,155,"Oaxaca","20","San Francisco Ixhuatán","143"]
[null,null,null,null,null,null,null,null,156,"Oaxaca","20","San Francisco Jaltepetongo","144"]
[null,null,null,null,null,null,null,null,157,"Oaxaca","20","San Francisco Lachigoló","145"]
[null,null,null,null,null,null,null,null,158,"Oaxaca","20","San Francisco Logueche","146"]
[null,null,null,null,null,null,null,null,159,"Oaxaca","20","San Francisco Nuxaño","147"]
[null,null,null,null,null,null,null,null,160,"Oaxaca","20","San Francisco Ozolotepec","148"]
[null,null,null,null,null,null,null,null,161,"Oaxaca","20","San Francisco Sola","149"]
[null,null,null,null,null,null,null,null,162,"Oaxaca","20","San Francisco Telixtlahuaca","150"]
[null,null,null,null,null,null,null,null,163,"Oaxaca","20","San Francisco Teopan","151"]
[null,null,null,null,null,null,null,null,164,"Oaxaca","20","San Francisco Tlapancingo","152"]
[null,null,null,null,null,null,null,null,165,"Oaxaca","20","San Gabriel Mixtepec","153"]
[null,null,null,null,null,null,null,null,166,"Oaxaca","20","San Ildefonso Amatlán","154"]
[null,null,null,null,null,null,null,null,167,"Oaxaca","20","San Ildefonso Sola","155"]
[null,null,null,null,null,null,null,null,168,"Oaxaca","20","San Ildefonso Villa Alta","156"]
[null,null,null,null,null,null,null,null,169,"Oaxaca","20","San Jacinto Amilpas","157"]
[null,null,null,null,null,null,null,null,170,"Oaxaca","20","San Jacinto Tlacotepec","158"]
[null,null,null,null,null,null,null,null,171,"Oaxaca","20","San Jerónimo Coatlán","159"]
[null,null,null,null,null,null,null,null,172,"Oaxaca","20","San Jerónimo Silacayoapilla","160"]
[null,null,null,null,null,null,null,null,173,"Oaxaca","20","San Jerónimo Sosola","161"]
[null,null,null,null,null,null,null,null,174,"Oaxaca","20","San Jerónimo Taviche","162"]
[null,null,null,null,null,null,null,null,175,"Oaxaca","20","San Jerónimo Tecóatl","163"]
[null,null,null,null,null,null,null,null,176,"Oaxaca","20","San Jorge Nuchita","164"]
[null,null,null,null,null,null,null,null,177,"Oaxaca","20","San José Ayuquila","165"]
[null,null,null,null,null,null,null,null,178,"Oaxaca","20","San José Chiltepec","166"]
[null,null,null,null,null,null,null,null,179,"Oaxaca","20","San José del Peñasco","167"]
[null,null,null,null,null,null,null,null,180,"Oaxaca","20","San José Estancia Grande","168"]
[null,null,null,null,null,null,null,null,181,"Oaxaca","20","San José Independencia","169"]
[null,null,null,null,null,null,null,null,182,"Oaxaca","20","San José Lachiguiri","170"]
[null,null,null,null,null,null,null,null,183,"Oaxaca","20","San José Tenango","171"]
[null,null,null,null,null,null,null,null,184,"Oaxaca","20","San Juan Achiutla","172"]
[null,null,null,null,null,null,null,null,185,"Oaxaca","20","San Juan Atepec","173"]
[null,null,null,null,null,null,null,null,186,"Oaxaca","20","Ánimas Trujano","174"]
[null,null,null,null,null,null,null,null,187,"Oaxaca","20","San Juan Bautista Atatlahuca","175"]
[null,null,null,null,null,null,null,null,188,"Oaxaca","20","San Juan Bautista Coixtlahuaca","176"]
[null,null,null,null,null,null,null,null,189,"Oaxaca","20","San Juan Bautista Cuicatlán","177"]
[null,null,null,null,null,null,null,null,190,"Oaxaca","20","San Juan Bautista Guelache","178"]
[null,null,null,null,null,null,null,null,191,"Oaxaca","20","San Juan Bautista Jayacatlán","179"]
[null,null,null,null,null,null,null,null,192,"Oaxaca","20","San Juan Bautista Lo de Soto","180"]
[null,null,null,null,null,null,null,null,193,"Oaxaca","20","San Juan Bautista Suchitepec","181"]
[null,null,null,null,null,null,null,null,194,"Oaxaca","20","San Juan Bautista Tlacoatzintepec","182"]
[null,null,null,null,null,null,null,null,195,"Oaxaca","20","San Juan Bautista Tlachichilco","183"]
[null,null,null,null,null,null,null,null,196,"Oaxaca","20","San Juan Bautista Tuxtepec","184"]
[null,null,null,null,null,null,null,null,197,"Oaxaca","20","San Juan Cacahuatepec","185"]
[null,null,null,null,null,null,null,null,198,"Oaxaca","20","San Juan Cieneguilla","186"]
[null,null,null,null,null,null,null,null,199,"Oaxaca","20","San Juan Coatzóspam","187"]
[null,null,null,null,null,null,null,null,200,"Oaxaca","20","San Juan Colorado","188"]
[null,null,null,null,null,null,null,null,201,"Oaxaca","20","San Juan Comaltepec","189"]
[null,null,null,null,null,null,null,null,202,"Oaxaca","20","San Juan Cotzocón","190"]
[null,null,null,null,null,null,null,null,203,"Oaxaca","20","San Juan Chicomezúchil","191"]
[null,null,null,null,null,null,null,null,204,"Oaxaca","20","San Juan Chilateca","192"]
[null,null,null,null,null,null,null,null,205,"Oaxaca","20","San Juan del Estado","193"]
[null,null,null,null,null,null,null,null,206,"Oaxaca","20","San Juan del Río","194"]
[null,null,null,null,null,null,null,null,207,"Oaxaca","20","San Juan Diuxi","195"]
[null,null,null,null,null,null,null,null,208,"Oaxaca","20","San Juan Evangelista Analco","196"]
[null,null,null,null,null,null,null,null,209,"Oaxaca","20","San Juan Guelavía","197"]
[null,null,null,null,null,null,null,null,210,"Oaxaca","20","San Juan Guichicovi","198"]
[null,null,null,null,null,null,null,null,211,"Oaxaca","20","San Juan Ihualtepec","199"]
[null,null,null,null,null,null,null,null,212,"Oaxaca","20","San Juan Juquila Mixes","200"]
[null,null,null,null,null,null,null,null,213,"Oaxaca","20","San Juan Juquila Vijanos","201"]
[null,null,null,null,null,null,null,null,214,"Oaxaca","20","San Juan Lachao","202"]
[null,null,null,null,null,null,null,null,215,"Oaxaca","20","San Juan Lachigalla","203"]
[null,null,null,null,null,null,null,null,216,"Oaxaca","20","San Juan Lajarcia","204"]
[null,null,null,null,null,null,null,null,217,"Oaxaca","20","San Juan Lalana","205"]
[null,null,null,null,null,null,null,null,218,"Oaxaca","20","San Juan de los Cués","206"]
[null,null,null,null,null,null,null,null,219,"Oaxaca","20","San Juan Mazatlán","207"]
[null,null,null,null,null,null,null,null,220,"Oaxaca","20","San Juan Mixtepec - Distrito 08","208"]
[null,null,null,null,null,null,null,null,221,"Oaxaca","20","San Juan Mixtepec - Distrito 26","209"]
[null,null,null,null,null,null,null,null,222,"Oaxaca","20","San Juan Ñumí","210"]
[null,null,null,null,null,null,null,null,223,"Oaxaca","20","San Juan Ozolotepec","211"]
[null,null,null,null,null,null,null,null,224,"Oaxaca","20","San Juan Petlapa","212"]
[null,null,null,null,null,null,null,null,225,"Oaxaca","20","San Juan Quiahije","213"]
[null,null,null,null,null,null,null,null,226,"Oaxaca","20","San Juan Quiotepec","214"]
[null,null,null,null,null,null,null,null,227,"Oaxaca","20","San Juan Sayultepec","215"]
[null,null,null,null,null,null,null,null,228,"Oaxaca","20","San Juan Tabaá","216"]
[null,null,null,null,null,null,null,null,229,"Oaxaca","20","San Juan Tamazola","217"]
[null,null,null,null,null,null,null,null,230,"Oaxaca","20","San Juan Teita","218"]
[null,null,null,null,null,null,null,null,231,"Oaxaca","20","San Juan Teitipac","219"]
[null,null,null,null,null,null,null,null,232,"Oaxaca","20","San Juan Tepeuxila","220"]
[null,null,null,null,null,null,null,null,233,"Oaxaca","20","San Juan Teposcolula","221"]
[null,null,null,null,null,null,null,null,234,"Oaxaca","20","San Juan Yaeé","222"]
[null,null,null,null,null,null,null,null,235,"Oaxaca","20","San Juan Yatzona","223"]
[null,null,null,null,null,null,null,null,236,"Oaxaca","20","San Juan Yucuita","224"]
[null,null,null,null,null,null,null,null,237,"Oaxaca","20","San Lorenzo","225"]
[null,null,null,null,null,null,null,null,238,"Oaxaca","20","San Lorenzo Albarradas","226"]
[null,null,null,null,null,null,null,null,239,"Oaxaca","20","San Lorenzo Cacaotepec","227"]
[null,null,null,null,null,null,null,null,240,"Oaxaca","20","San Lorenzo Cuaunecuiltitla","228"]
[null,null,null,null,null,null,null,null,241,"Oaxaca","20","San Lorenzo Texmelúcan","229"]
[null,null,null,null,null,null,null,null,242,"Oaxaca","20","San Lorenzo Victoria","230"]
[null,null,null,null,null,null,null,null,243,"Oaxaca","20","San Lucas Camotlán","231"]
[null,null,null,null,null,null,null,null,244,"Oaxaca","20","San Lucas Ojitlán","232"]
[null,null,null,null,null,null,null,null,245,"Oaxaca","20","San Lucas Quiaviní","233"]
[null,null,null,null,null,null,null,null,246,"Oaxaca","20","San Lucas Zoquiápam","234"]
[null,null,null,null,null,null,null,null,247,"Oaxaca","20","San Luis Amatlán","235"]
[null,null,null,null,null,null,null,null,248,"Oaxaca","20","San Marcial Ozolotepec","236"]
[null,null,null,null,null,null,null,null,249,"Oaxaca","20","San Marcos Arteaga","237"]
[null,null,null,null,null,null,null,null,250,"Oaxaca","20","San Martín de los Cansecos","238"]
[null,null,null,null,null,null,null,null,251,"Oaxaca","20","San Martín Huamelúlpam","239"]
[null,null,null,null,null,null,null,null,252,"Oaxaca","20","San Martín Itunyoso","240"]
[null,null,null,null,null,null,null,null,253,"Oaxaca","20","San Martín Lachilá","241"]
[null,null,null,null,null,null,null,null,254,"Oaxaca","20","San Martín Peras","242"]
[null,null,null,null,null,null,null,null,255,"Oaxaca","20","San Martín Tilcajete","243"]
[null,null,null,null,null,null,null,null,256,"Oaxaca","20","San Martín Toxpalan","244"]
[null,null,null,null,null,null,null,null,257,"Oaxaca","20","San Martín Zacatepec","245"]
[null,null,null,null,null,null,null,null,258,"Oaxaca","20","San Mateo Cajonos","246"]
[null,null,null,null,null,null,null,null,259,"Oaxaca","20","Capulálpam de Méndez","247"]
[null,null,null,null,null,null,null,null,260,"Oaxaca","20","San Mateo del Mar","248"]
[null,null,null,null,null,null,null,null,261,"Oaxaca","20","San Mateo Yoloxochitlán","249"]
[null,null,null,null,null,null,null,null,262,"Oaxaca","20","San Mateo Etlatongo","250"]
[null,null,null,null,null,null,null,null,263,"Oaxaca","20","San Mateo Nejápam","251"]
[null,null,null,null,null,null,null,null,264,"Oaxaca","20","San Mateo Peñasco","252"]
[null,null,null,null,null,null,null,null,265,"Oaxaca","20","San Mateo Piñas","253"]
[null,null,null,null,null,null,null,null,266,"Oaxaca","20","San Mateo Río Hondo","254"]
[null,null,null,null,null,null,null,null,267,"Oaxaca","20","San Mateo Sindihui","255"]
[null,null,null,null,null,null,null,null,268,"Oaxaca","20","San Mateo Tlapiltepec","256"]
[null,null,null,null,null,null,null,null,269,"Oaxaca","20","San Melchor Betaza","257"]
[null,null,null,null,null,null,null,null,270,"Oaxaca","20","San Miguel Achiutla","258"]
[null,null,null,null,null,null,null,null,271,"Oaxaca","20","San Miguel Ahuehuetitlán","259"]
[null,null,null,null,null,null,null,null,272,"Oaxaca","20","San Miguel Aloápam","260"]
[null,null,null,null,null,null,null,null,273,"Oaxaca","20","San Miguel Amatitlán","261"]
[null,null,null,null,null,null,null,null,274,"Oaxaca","20","San Miguel Amatlán","262"]
[null,null,null,null,null,null,null,null,275,"Oaxaca","20","San Miguel Coatlán","263"]
[null,null,null,null,null,null,null,null,276,"Oaxaca","20","San Miguel Chicahua","264"]
[null,null,null,null,null,null,null,null,277,"Oaxaca","20","San Miguel Chimalapa","265"]
[null,null,null,null,null,null,null,null,278,"Oaxaca","20","San Miguel del Puerto","266"]
[null,null,null,null,null,null,null,null,279,"Oaxaca","20","San Miguel del Río","267"]
[null,null,null,null,null,null,null,null,280,"Oaxaca","20","San Miguel Ejutla","268"]
[null,null,null,null,null,null,null,null,281,"Oaxaca","20","San Miguel el Grande","269"]
[null,null,null,null,null,null,null,null,282,"Oaxaca","20","San Miguel Huautla","270"]
[null,null,null,null,null,null,null,null,283,"Oaxaca","20","San Miguel Mixtepec","271"]
[null,null,null,null,null,null,null,null,284,"Oaxaca","20","San Miguel Panixtlahuaca","272"]
[null,null,null,null,null,null,null,null,285,"Oaxaca","20","San Miguel Peras","273"]
[null,null,null,null,null,null,null,null,286,"Oaxaca","20","San Miguel Piedras","274"]
[null,null,null,null,null,null,null,null,287,"Oaxaca","20","San Miguel Quetzaltepec","275"]
[null,null,null,null,null,null,null,null,288,"Oaxaca","20","San Miguel Santa Flor","276"]
[null,null,null,null,null,null,null,null,289,"Oaxaca","20","Villa Sola de Vega","277"]
[null,null,null,null,null,null,null,null,290,"Oaxaca","20","San Miguel Soyaltepec","278"]
[null,null,null,null,null,null,null,null,291,"Oaxaca","20","San Miguel Suchixtepec","279"]
[null,null,null,null,null,null,null,null,292,"Oaxaca","20","Villa Talea de Castro","280"]
[null,null,null,null,null,null,null,null,293,"Oaxaca","20","San Miguel Tecomatlán","281"]
[null,null,null,null,null,null,null,null,294,"Oaxaca","20","San Miguel Tenango","282"]
[null,null,null,null,null,null,null,null,295,"Oaxaca","20","San Miguel Tequixtepec","283"]
[null,null,null,null,null,null,null,null,296,"Oaxaca","20","San Miguel Tilquiápam","284"]
[null,null,null,null,null,null,null,null,297,"Oaxaca","20","San Miguel Tlacamama","285"]
[null,null,null,null,null,null,null,null,298,"Oaxaca","20","San Miguel Tlacotepec","286"]
[null,null,null,null,null,null,null,null,299,"Oaxaca","20","San Miguel Tulancingo","287"]
[null,null,null,null,null,null,null,null,300,"Oaxaca","20","San Miguel Yotao","288"]
[null,null,null,null,null,null,null,null,301,"Oaxaca","20","San Nicolás","289"]
[null,null,null,null,null,null,null,null,302,"Oaxaca","20","San Nicolás Hidalgo","290"]
[null,null,null,null,null,null,null,null,303,"Oaxaca","20","San Pablo Coatlán","291"]
[null,null,null,null,null,null,null,null,304,"Oaxaca","20","San Pablo Cuatro Venados","292"]
[null,null,null,null,null,null,null,null,305,"Oaxaca","20","San Pablo Etla","293"]
[null,null,null,null,null,null,null,null,306,"Oaxaca","20","San Pablo Huitzo","294"]
[null,null,null,null,null,null,null,null,307,"Oaxaca","20","San Pablo Huixtepec","295"]
[null,null,null,null,null,null,null,null,308,"Oaxaca","20","San Pablo Macuiltianguis","296"]
[null,null,null,null,null,null,null,null,309,"Oaxaca","20","San Pablo Tijaltepec","297"]
[null,null,null,null,null,null,null,null,310,"Oaxaca","20","San Pablo Villa de Mitla","298"]
[null,null,null,null,null,null,null,null,311,"Oaxaca","20","San Pablo Yaganiza","299"]
[null,null,null,null,null,null,null,null,312,"Oaxaca","20","San Pedro Amuzgos","300"]
[null,null,null,null,null,null,null,null,313,"Oaxaca","20","San Pedro Apóstol","301"]
[null,null,null,null,null,null,null,null,314,"Oaxaca","20","San Pedro Atoyac","302"]
[null,null,null,null,null,null,null,null,315,"Oaxaca","20","San Pedro Cajonos","303"]
[null,null,null,null,null,null,null,null,316,"Oaxaca","20","San Pedro Coxcaltepec Cántaros","304"]
[null,null,null,null,null,null,null,null,317,"Oaxaca","20","San Pedro Comitancillo","305"]
[null,null,null,null,null,null,null,null,318,"Oaxaca","20","San Pedro el Alto","306"]
[null,null,null,null,null,null,null,null,319,"Oaxaca","20","San Pedro Huamelula","307"]
[null,null,null,null,null,null,null,null,320,"Oaxaca","20","San Pedro Huilotepec","308"]
[null,null,null,null,null,null,null,null,321,"Oaxaca","20","San Pedro Ixcatlán","309"]
[null,null,null,null,null,null,null,null,322,"Oaxaca","20","San Pedro Ixtlahuaca","310"]
[null,null,null,null,null,null,null,null,323,"Oaxaca","20","San Pedro Jaltepetongo","311"]
[null,null,null,null,null,null,null,null,324,"Oaxaca","20","San Pedro Jicayán","312"]
[null,null,null,null,null,null,null,null,325,"Oaxaca","20","San Pedro Jocotipac","313"]
[null,null,null,null,null,null,null,null,326,"Oaxaca","20","San Pedro Juchatengo","314"]
[null,null,null,null,null,null,null,null,327,"Oaxaca","20","San Pedro Mártir","315"]
[null,null,null,null,null,null,null,null,328,"Oaxaca","20","San Pedro Mártir Quiechapa","316"]
[null,null,null,null,null,null,null,null,329,"Oaxaca","20","San Pedro Mártir Yucuxaco","317"]
[null,null,null,null,null,null,null,null,330,"Oaxaca","20","San Pedro Mixtepec - Distrito 22","318"]
[null,null,null,null,null,null,null,null,331,"Oaxaca","20","San Pedro Mixtepec - Distrito 26","319"]
[null,null,null,null,null,null,null,null,332,"Oaxaca","20","San Pedro Molinos","320"]
[null,null,null,null,null,null,null,null,333,"Oaxaca","20","San Pedro Nopala","321"]
[null,null,null,null,null,null,null,null,334,"Oaxaca","20","San Pedro Ocopetatillo","322"]
[null,null,null,null,null,null,null,null,335,"Oaxaca","20","San Pedro Ocotepec","323"]
[null,null,null,null,null,null,null,null,336,"Oaxaca","20","San Pedro Pochutla","324"]
[null,null,null,null,null,null,null,null,337,"Oaxaca","20","San Pedro Quiatoni","325"]
[null,null,null,null,null,null,null,null,338,"Oaxaca","20","San Pedro Sochiápam","326"]
[null,null,null,null,null,null,null,null,339,"Oaxaca","20","San Pedro Tapanatepec","327"]
[null,null,null,null,null,null,null,null,340,"Oaxaca","20","San Pedro Taviche","328"]
[null,null,null,null,null,null,null,null,341,"Oaxaca","20","San Pedro Teozacoalco","329"]
[null,null,null,null,null,null,null,null,342,"Oaxaca","20","San Pedro Teutila","330"]
[null,null,null,null,null,null,null,null,343,"Oaxaca","20","San Pedro Tidaá","331"]
[null,null,null,null,null,null,null,null,344,"Oaxaca","20","San Pedro Topiltepec","332"]
[null,null,null,null,null,null,null,null,345,"Oaxaca","20","San Pedro Totolápam","333"]
[null,null,null,null,null,null,null,null,346,"Oaxaca","20","Villa de Tututepec","334"]
[null,null,null,null,null,null,null,null,347,"Oaxaca","20","San Pedro Yaneri","335"]
[null,null,null,null,null,null,null,null,348,"Oaxaca","20","San Pedro Yólox","336"]
[null,null,null,null,null,null,null,null,349,"Oaxaca","20","San Pedro y San Pablo Ayutla","337"]
[null,null,null,null,null,null,null,null,350,"Oaxaca","20","Villa de Etla","338"]
[null,null,null,null,null,null,null,null,351,"Oaxaca","20","San Pedro y San Pablo Teposcolula","339"]
[null,null,null,null,null,null,null,null,352,"Oaxaca","20","San Pedro y San Pablo Tequixtepec","340"]
[null,null,null,null,null,null,null,null,353,"Oaxaca","20","San Pedro Yucunama","341"]
[null,null,null,null,null,null,null,null,354,"Oaxaca","20","San Raymundo Jalpan","342"]
[null,null,null,null,null,null,null,null,355,"Oaxaca","20","San Sebastián Abasolo","343"]
[null,null,null,null,null,null,null,null,356,"Oaxaca","20","San Sebastián Coatlán","344"]
[null,null,null,null,null,null,null,null,357,"Oaxaca","20","San Sebastián Ixcapa","345"]
[null,null,null,null,null,null,null,null,358,"Oaxaca","20","San Sebastián Nicananduta","346"]
[null,null,null,null,null,null,null,null,359,"Oaxaca","20","San Sebastián Río Hondo","347"]
[null,null,null,null,null,null,null,null,360,"Oaxaca","20","San Sebastián Tecomaxtlahuaca","348"]
[null,null,null,null,null,null,null,null,361,"Oaxaca","20","San Sebastián Teitipac","349"]
[null,null,null,null,null,null,null,null,362,"Oaxaca","20","San Sebastián Tutla","350"]
[null,null,null,null,null,null,null,null,363,"Oaxaca","20","San Simón Almolongas","351"]
[null,null,null,null,null,null,null,null,364,"Oaxaca","20","San Simón Zahuatlán","352"]
[null,null,null,null,null,null,null,null,365,"Oaxaca","20","Santa Ana","353"]
[null,null,null,null,null,null,null,null,366,"Oaxaca","20","Santa Ana Ateixtlahuaca","354"]
[null,null,null,null,null,null,null,null,367,"Oaxaca","20","Santa Ana Cuauhtémoc","355"]
[null,null,null,null,null,null,null,null,368,"Oaxaca","20","Santa Ana del Valle","356"]
[null,null,null,null,null,null,null,null,369,"Oaxaca","20","Santa Ana Tavela","357"]
[null,null,null,null,null,null,null,null,370,"Oaxaca","20","Santa Ana Tlapacoyan","358"]
[null,null,null,null,null,null,null,null,371,"Oaxaca","20","Santa Ana Yareni","359"]
[null,null,null,null,null,null,null,null,372,"Oaxaca","20","Santa Ana Zegache","360"]
[null,null,null,null,null,null,null,null,373,"Oaxaca","20","Santa Catalina Quierí","361"]
[null,null,null,null,null,null,null,null,374,"Oaxaca","20","Santa Catarina Cuixtla","362"]
[null,null,null,null,null,null,null,null,375,"Oaxaca","20","Santa Catarina Ixtepeji","363"]
[null,null,null,null,null,null,null,null,376,"Oaxaca","20","Santa Catarina Juquila","364"]
[null,null,null,null,null,null,null,null,377,"Oaxaca","20","Santa Catarina Lachatao","365"]
[null,null,null,null,null,null,null,null,378,"Oaxaca","20","Santa Catarina Loxicha","366"]
[null,null,null,null,null,null,null,null,379,"Oaxaca","20","Santa Catarina Mechoacán","367"]
[null,null,null,null,null,null,null,null,380,"Oaxaca","20","Santa Catarina Minas","368"]
[null,null,null,null,null,null,null,null,381,"Oaxaca","20","Santa Catarina Quiané","369"]
[null,null,null,null,null,null,null,null,382,"Oaxaca","20","Santa Catarina Tayata","370"]
[null,null,null,null,null,null,null,null,383,"Oaxaca","20","Santa Catarina Ticuá","371"]
[null,null,null,null,null,null,null,null,384,"Oaxaca","20","Santa Catarina Yosonotú","372"]
[null,null,null,null,null,null,null,null,385,"Oaxaca","20","Santa Catarina Zapoquila","373"]
[null,null,null,null,null,null,null,null,386,"Oaxaca","20","Santa Cruz Acatepec","374"]
[null,null,null,null,null,null,null,null,387,"Oaxaca","20","Santa Cruz Amilpas","375"]
[null,null,null,null,null,null,null,null,388,"Oaxaca","20","Santa Cruz de Bravo","376"]
[null,null,null,null,null,null,null,null,389,"Oaxaca","20","Santa Cruz Itundujia","377"]
[null,null,null,null,null,null,null,null,390,"Oaxaca","20","Santa Cruz Mixtepec","378"]
[null,null,null,null,null,null,null,null,391,"Oaxaca","20","Santa Cruz Nundaco","379"]
[null,null,null,null,null,null,null,null,392,"Oaxaca","20","Santa Cruz Papalutla","380"]
[null,null,null,null,null,null,null,null,393,"Oaxaca","20","Santa Cruz Tacache de Mina","381"]
[null,null,null,null,null,null,null,null,394,"Oaxaca","20","Santa Cruz Tacahua","382"]
[null,null,null,null,null,null,null,null,395,"Oaxaca","20","Santa Cruz Tayata","383"]
[null,null,null,null,null,null,null,null,396,"Oaxaca","20","Santa Cruz Xitla","384"]
[null,null,null,null,null,null,null,null,397,"Oaxaca","20","Santa Cruz Xoxocotlán","385"]
[null,null,null,null,null,null,null,null,398,"Oaxaca","20","Santa Cruz Zenzontepec","386"]
[null,null,null,null,null,null,null,null,399,"Oaxaca","20","Santa Gertrudis","387"]
[null,null,null,null,null,null,null,null,400,"Oaxaca","20","Santa Inés del Monte","388"]
[null,null,null,null,null,null,null,null,401,"Oaxaca","20","Santa Inés Yatzeche","389"]
[null,null,null,null,null,null,null,null,402,"Oaxaca","20","Santa Lucía del Camino","390"]
[null,null,null,null,null,null,null,null,403,"Oaxaca","20","Santa Lucía Miahuatlán","391"]
[null,null,null,null,null,null,null,null,404,"Oaxaca","20","Santa Lucía Monteverde","392"]
[null,null,null,null,null,null,null,null,405,"Oaxaca","20","Santa Lucía Ocotlán","393"]
[null,null,null,null,null,null,null,null,406,"Oaxaca","20","Santa María Alotepec","394"]
[null,null,null,null,null,null,null,null,407,"Oaxaca","20","Santa María Apazco","395"]
[null,null,null,null,null,null,null,null,408,"Oaxaca","20","Santa María la Asunción","396"]
[null,null,null,null,null,null,null,null,409,"Oaxaca","20","Heroica Ciudad de Tlaxiaco","397"]
[null,null,null,null,null,null,null,null,410,"Oaxaca","20","Ayoquezco de Aldama","398"]
[null,null,null,null,null,null,null,null,411,"Oaxaca","20","Santa María Atzompa","399"]
[null,null,null,null,null,null,null,null,412,"Oaxaca","20","Santa María Camotlán","400"]
[null,null,null,null,null,null,null,null,413,"Oaxaca","20","Santa María Colotepec","401"]
[null,null,null,null,null,null,null,null,414,"Oaxaca","20","Santa María Cortijo","402"]
[null,null,null,null,null,null,null,null,415,"Oaxaca","20","Santa María Coyotepec","403"]
[null,null,null,null,null,null,null,null,416,"Oaxaca","20","Santa María Chachoápam","404"]
[null,null,null,null,null,null,null,null,417,"Oaxaca","20","Villa de Chilapa de Díaz","405"]
[null,null,null,null,null,null,null,null,418,"Oaxaca","20","Santa María Chilchotla","406"]
[null,null,null,null,null,null,null,null,419,"Oaxaca","20","Santa María Chimalapa","407"]
[null,null,null,null,null,null,null,null,420,"Oaxaca","20","Santa María del Rosario","408"]
[null,null,null,null,null,null,null,null,421,"Oaxaca","20","Santa María del Tule","409"]
[null,null,null,null,null,null,null,null,422,"Oaxaca","20","Santa María Ecatepec","410"]
[null,null,null,null,null,null,null,null,423,"Oaxaca","20","Santa María Guelacé","411"]
[null,null,null,null,null,null,null,null,424,"Oaxaca","20","Santa María Guienagati","412"]
[null,null,null,null,null,null,null,null,425,"Oaxaca","20","Santa María Huatulco","413"]
[null,null,null,null,null,null,null,null,426,"Oaxaca","20","Santa María Huazolotitlán","414"]
[null,null,null,null,null,null,null,null,427,"Oaxaca","20","Santa María Ipalapa","415"]
[null,null,null,null,null,null,null,null,428,"Oaxaca","20","Santa María Ixcatlán","416"]
[null,null,null,null,null,null,null,null,429,"Oaxaca","20","Santa María Jacatepec","417"]
[null,null,null,null,null,null,null,null,430,"Oaxaca","20","Santa María Jalapa del Marqués","418"]
[null,null,null,null,null,null,null,null,431,"Oaxaca","20","Santa María Jaltianguis","419"]
[null,null,null,null,null,null,null,null,432,"Oaxaca","20","Santa María Lachixío","420"]
[null,null,null,null,null,null,null,null,433,"Oaxaca","20","Santa María Mixtequilla","421"]
[null,null,null,null,null,null,null,null,434,"Oaxaca","20","Santa María Nativitas","422"]
[null,null,null,null,null,null,null,null,435,"Oaxaca","20","Santa María Nduayaco","423"]
[null,null,null,null,null,null,null,null,436,"Oaxaca","20","Santa María Ozolotepec","424"]
[null,null,null,null,null,null,null,null,437,"Oaxaca","20","Santa María Pápalo","425"]
[null,null,null,null,null,null,null,null,438,"Oaxaca","20","Santa María Peñoles","426"]
[null,null,null,null,null,null,null,null,439,"Oaxaca","20","Santa María Petapa","427"]
[null,null,null,null,null,null,null,null,440,"Oaxaca","20","Santa María Quiegolani","428"]
[null,null,null,null,null,null,null,null,441,"Oaxaca","20","Santa María Sola","429"]
[null,null,null,null,null,null,null,null,442,"Oaxaca","20","Santa María Tataltepec","430"]
[null,null,null,null,null,null,null,null,443,"Oaxaca","20","Santa María Tecomavaca","431"]
[null,null,null,null,null,null,null,null,444,"Oaxaca","20","Santa María Temaxcalapa","432"]
[null,null,null,null,null,null,null,null,445,"Oaxaca","20","Santa María Temaxcaltepec","433"]
[null,null,null,null,null,null,null,null,446,"Oaxaca","20","Santa María Teopoxco","434"]
[null,null,null,null,null,null,null,null,447,"Oaxaca","20","Santa María Tepantlali","435"]
[null,null,null,null,null,null,null,null,448,"Oaxaca","20","Santa María Texcatitlán","436"]
[null,null,null,null,null,null,null,null,449,"Oaxaca","20","Santa María Tlahuitoltepec","437"]
[null,null,null,null,null,null,null,null,450,"Oaxaca","20","Santa María Tlalixtac","438"]
[null,null,null,null,null,null,null,null,451,"Oaxaca","20","Santa María Tonameca","439"]
[null,null,null,null,null,null,null,null,452,"Oaxaca","20","Santa María Totolapilla","440"]
[null,null,null,null,null,null,null,null,453,"Oaxaca","20","Santa María Xadani","441"]
[null,null,null,null,null,null,null,null,454,"Oaxaca","20","Santa María Yalina","442"]
[null,null,null,null,null,null,null,null,455,"Oaxaca","20","Santa María Yavesía","443"]
[null,null,null,null,null,null,null,null,456,"Oaxaca","20","Santa María Yolotepec","444"]
[null,null,null,null,null,null,null,null,457,"Oaxaca","20","Santa María Yosoyúa","445"]
[null,null,null,null,null,null,null,null,458,"Oaxaca","20","Santa María Yucuhiti","446"]
[null,null,null,null,null,null,null,null,459,"Oaxaca","20","Santa María Zacatepec","447"]
[null,null,null,null,null,null,null,null,460,"Oaxaca","20","Santa María Zaniza","448"]
[null,null,null,null,null,null,null,null,461,"Oaxaca","20","Santa María Zoquitlán","449"]
[null,null,null,null,null,null,null,null,462,"Oaxaca","20","Santiago Amoltepec","450"]
[null,null,null,null,null,null,null,null,463,"Oaxaca","20","Santiago Apoala","451"]
[null,null,null,null,null,null,null,null,464,"Oaxaca","20","Santiago Apóstol","452"]
[null,null,null,null,null,null,null,null,465,"Oaxaca","20","Santiago Astata","453"]
[null,null,null,null,null,null,null,null,466,"Oaxaca","20","Santiago Atitlán","454"]
[null,null,null,null,null,null,null,null,467,"Oaxaca","20","Santiago Ayuquililla","455"]
[null,null,null,null,null,null,null,null,468,"Oaxaca","20","Santiago Cacaloxtepec","456"]
[null,null,null,null,null,null,null,null,469,"Oaxaca","20","Santiago Camotlán","457"]
[null,null,null,null,null,null,null,null,470,"Oaxaca","20","Santiago Comaltepec","458"]
[null,null,null,null,null,null,null,null,471,"Oaxaca","20","Villa de Santiago Chazumba","459"]
[null,null,null,null,null,null,null,null,472,"Oaxaca","20","Santiago Choápam","460"]
[null,null,null,null,null,null,null,null,473,"Oaxaca","20","Santiago del Río","461"]
[null,null,null,null,null,null,null,null,474,"Oaxaca","20","Santiago Huajolotitlán","462"]
[null,null,null,null,null,null,null,null,475,"Oaxaca","20","Santiago Huauclilla","463"]
[null,null,null,null,null,null,null,null,476,"Oaxaca","20","Santiago Ihuitlán Plumas","464"]
[null,null,null,null,null,null,null,null,477,"Oaxaca","20","Santiago Ixcuintepec","465"]
[null,null,null,null,null,null,null,null,478,"Oaxaca","20","Santiago Ixtayutla","466"]
[null,null,null,null,null,null,null,null,479,"Oaxaca","20","Santiago Jamiltepec","467"]
[null,null,null,null,null,null,null,null,480,"Oaxaca","20","Santiago Jocotepec","468"]
[null,null,null,null,null,null,null,null,481,"Oaxaca","20","Santiago Juxtlahuaca","469"]
[null,null,null,null,null,null,null,null,482,"Oaxaca","20","Santiago Lachiguiri","470"]
[null,null,null,null,null,null,null,null,483,"Oaxaca","20","Santiago Lalopa","471"]
[null,null,null,null,null,null,null,null,484,"Oaxaca","20","Santiago Laollaga","472"]
[null,null,null,null,null,null,null,null,485,"Oaxaca","20","Santiago Laxopa","473"]
[null,null,null,null,null,null,null,null,486,"Oaxaca","20","Santiago Llano Grande","474"]
[null,null,null,null,null,null,null,null,487,"Oaxaca","20","Santiago Matatlán","475"]
[null,null,null,null,null,null,null,null,488,"Oaxaca","20","Santiago Miltepec","476"]
[null,null,null,null,null,null,null,null,489,"Oaxaca","20","Santiago Minas","477"]
[null,null,null,null,null,null,null,null,490,"Oaxaca","20","Santiago Nacaltepec","478"]
[null,null,null,null,null,null,null,null,491,"Oaxaca","20","Santiago Nejapilla","479"]
[null,null,null,null,null,null,null,null,492,"Oaxaca","20","Santiago Nundiche","480"]
[null,null,null,null,null,null,null,null,493,"Oaxaca","20","Santiago Nuyoó","481"]
[null,null,null,null,null,null,null,null,494,"Oaxaca","20","Santiago Pinotepa Nacional","482"]
[null,null,null,null,null,null,null,null,495,"Oaxaca","20","Santiago Suchilquitongo","483"]
[null,null,null,null,null,null,null,null,496,"Oaxaca","20","Santiago Tamazola","484"]
[null,null,null,null,null,null,null,null,497,"Oaxaca","20","Santiago Tapextla","485"]
[null,null,null,null,null,null,null,null,498,"Oaxaca","20","Villa Tejúpam de la Unión","486"]
[null,null,null,null,null,null,null,null,499,"Oaxaca","20","Santiago Tenango","487"]
[null,null,null,null,null,null,null,null,500,"Oaxaca","20","Santiago Tepetlapa","488"]
[null,null,null,null,null,null,null,null,501,"Oaxaca","20","Santiago Tetepec","489"]
[null,null,null,null,null,null,null,null,502,"Oaxaca","20","Santiago Texcalcingo","490"]
[null,null,null,null,null,null,null,null,503,"Oaxaca","20","Santiago Textitlán","491"]
[null,null,null,null,null,null,null,null,504,"Oaxaca","20","Santiago Tilantongo","492"]
[null,null,null,null,null,null,null,null,505,"Oaxaca","20","Santiago Tillo","493"]
[null,null,null,null,null,null,null,null,506,"Oaxaca","20","Santiago Tlazoyaltepec","494"]
[null,null,null,null,null,null,null,null,507,"Oaxaca","20","Santiago Xanica","495"]
[null,null,null,null,null,null,null,null,508,"Oaxaca","20","Santiago Xiacuí","496"]
[null,null,null,null,null,null,null,null,509,"Oaxaca","20","Santiago Yaitepec","497"]
[null,null,null,null,null,null,null,null,510,"Oaxaca","20","Santiago Yaveo","498"]
[null,null,null,null,null,null,null,null,511,"Oaxaca","20","Santiago Yolomécatl","499"]
[null,null,null,null,null,null,null,null,512,"Oaxaca","20","Santiago Yosondúa","500"]
[null,null,null,null,null,null,null,null,513,"Oaxaca","20","Santiago Yucuyachi","501"]
[null,null,null,null,null,null,null,null,514,"Oaxaca","20","Santiago Zacatepec","502"]
[null,null,null,null,null,null,null,null,515,"Oaxaca","20","Santiago Zoochila","503"]
[null,null,null,null,null,null,null,null,516,"Oaxaca","20","Nuevo Zoquiápam","504"]
[null,null,null,null,null,null,null,null,517,"Oaxaca","20","Santo Domingo Ingenio","505"]
[null,null,null,null,null,null,null,null,518,"Oaxaca","20","Santo Domingo Albarradas","506"]
[null,null,null,null,null,null,null,null,519,"Oaxaca","20","Santo Domingo Armenta","507"]
[null,null,null,null,null,null,null,null,520,"Oaxaca","20","Santo Domingo Chihuitán","508"]
[null,null,null,null,null,null,null,null,521,"Oaxaca","20","Santo Domingo de Morelos","509"]
[null,null,null,null,null,null,null,null,522,"Oaxaca","20","Santo Domingo Ixcatlán","510"]
[null,null,null,null,null,null,null,null,523,"Oaxaca","20","Santo Domingo Nuxaá","511"]
[null,null,null,null,null,null,null,null,524,"Oaxaca","20","Santo Domingo Ozolotepec","512"]
[null,null,null,null,null,null,null,null,525,"Oaxaca","20","Santo Domingo Petapa","513"]
[null,null,null,null,null,null,null,null,526,"Oaxaca","20","Santo Domingo Roayaga","514"]
[null,null,null,null,null,null,null,null,527,"Oaxaca","20","Santo Domingo Tehuantepec","515"]
[null,null,null,null,null,null,null,null,528,"Oaxaca","20","Santo Domingo Teojomulco","516"]
[null,null,null,null,null,null,null,null,529,"Oaxaca","20","Santo Domingo Tepuxtepec","517"]
[null,null,null,null,null,null,null,null,530,"Oaxaca","20","Santo Domingo Tlatayápam","518"]
[null,null,null,null,null,null,null,null,531,"Oaxaca","20","Santo Domingo Tomaltepec","519"]
[null,null,null,null,null,null,null,null,532,"Oaxaca","20","Santo Domingo Tonalá","520"]
[null,null,null,null,null,null,null,null,533,"Oaxaca","20","Santo Domingo Tonaltepec","521"]
[null,null,null,null,null,null,null,null,534,"Oaxaca","20","Santo Domingo Xagacía","522"]
[null,null,null,null,null,null,null,null,535,"Oaxaca","20","Santo Domingo Yanhuitlán","523"]
[null,null,null,null,null,null,null,null,536,"Oaxaca","20","Santo Domingo Yodohino","524"]
[null,null,null,null,null,null,null,null,537,"Oaxaca","20","Santo Domingo Zanatepec","525"]
[null,null,null,null,null,null,null,null,538,"Oaxaca","20","Santos Reyes Nopala","526"]
[null,null,null,null,null,null,null,null,539,"Oaxaca","20","Santos Reyes Pápalo","527"]
[null,null,null,null,null,null,null,null,540,"Oaxaca","20","Santos Reyes Tepejillo","528"]
[null,null,null,null,null,null,null,null,541,"Oaxaca","20","Santos Reyes Yucuná","529"]
[null,null,null,null,null,null,null,null,542,"Oaxaca","20","Santo Tomás Jalieza","530"]
[null,null,null,null,null,null,null,null,543,"Oaxaca","20","Santo Tomás Mazaltepec","531"]
[null,null,null,null,null,null,null,null,544,"Oaxaca","20","Santo Tomás Ocotepec","532"]
[null,null,null,null,null,null,null,null,545,"Oaxaca","20","Santo Tomás Tamazulapan","533"]
[null,null,null,null,null,null,null,null,546,"Oaxaca","20","San Vicente Coatlán","534"]
[null,null,null,null,null,null,null,null,547,"Oaxaca","20","San Vicente Lachixío","535"]
[null,null,null,null,null,null,null,null,548,"Oaxaca","20","San Vicente Nuñú","536"]
[null,null,null,null,null,null,null,null,549,"Oaxaca","20","Silacayoápam","537"]
[null,null,null,null,null,null,null,null,550,"Oaxaca","20","Sitio de Xitlapehua","538"]
[null,null,null,null,null,null,null,null,551,"Oaxaca","20","Soledad Etla","539"]
[null,null,null,null,null,null,null,null,552,"Oaxaca","20","Villa de Tamazulápam del Progreso","540"]
[null,null,null,null,null,null,null,null,553,"Oaxaca","20","Tanetze de Zaragoza","541"]
[null,null,null,null,null,null,null,null,554,"Oaxaca","20","Taniche","542"]
[null,null,null,null,null,null,null,null,555,"Oaxaca","20","Tataltepec de Valdés","543"]
[null,null,null,null,null,null,null,null,556,"Oaxaca","20","Teococuilco de Marcos Pérez","544"]
[null,null,null,null,null,null,null,null,557,"Oaxaca","20","Teotitlán de Flores Magón","545"]
[null,null,null,null,null,null,null,null,558,"Oaxaca","20","Teotitlán del Valle","546"]
[null,null,null,null,null,null,null,null,559,"Oaxaca","20","Teotongo","547"]
[null,null,null,null,null,null,null,null,560,"Oaxaca","20","Tepelmeme Villa de Morelos","548"]
[null,null,null,null,null,null,null,null,561,"Oaxaca","20","Heroica Villa Tezoatlán de Segura y Luna, Cuna de la Independencia de Oaxaca","549"]
[null,null,null,null,null,null,null,null,562,"Oaxaca","20","San Jerónimo Tlacochahuaya","550"]
[null,null,null,null,null,null,null,null,563,"Oaxaca","20","Tlacolula de Matamoros","551"]
[null,null,null,null,null,null,null,null,564,"Oaxaca","20","Tlacotepec Plumas","552"]
[null,null,null,null,null,null,null,null,565,"Oaxaca","20","Tlalixtac de Cabrera","553"]
[null,null,null,null,null,null,null,null,566,"Oaxaca","20","Totontepec Villa de Morelos","554"]
[null,null,null,null,null,null,null,null,567,"Oaxaca","20","Trinidad Zaachila","555"]
[null,null,null,null,null,null,null,null,568,"Oaxaca","20","La Trinidad Vista Hermosa","556"]
[null,null,null,null,null,null,null,null,569,"Oaxaca","20","Unión Hidalgo","557"]
[null,null,null,null,null,null,null,null,570,"Oaxaca","20","Valerio Trujano","558"]
[null,null,null,null,null,null,null,null,null,"Oaxaca","20","San Juan Bautista Valle Nacional","559"]
[null,null,null,null,null,null,null,null,null,"Oaxaca","20","Villa Díaz Ordaz","560"]
[null,null,null,null,null,null,null,null,null,"Oaxaca","20","Yaxe","561"]
[null,null,null,null,null,null,null,null,null,"Oaxaca","20","Magdalena Yodocono de Porfirio Díaz","562"]
[null,null,null,null,null,null,null,null,null,"Oaxaca","20","Yogana","563"]
[null,null,null,null,null,null,null,null,null,"Oaxaca","20","Yutanduchi de Guerrero","564"]
[null,null,null,null,null,null,null,null,null,"Oaxaca","20","Villa de Zaachila","565"]
[null,null,null,null,null,null,null,null,null,"Oaxaca","20","San Mateo Yucutindoo","566"]
[null,null,null,null,null,null,null,null,null,"Oaxaca","20","Zapotitlán Lagunas","567"]
[null,null,null,null,null,null,null,null,null,"Oaxaca","20","Zapotitlán Palmas","568"]
[null,null,null,null,null,null,null,null,null,"Oaxaca","20","Santa Inés de Zaragoza","569"]
[null,null,null,null,null,null,null,null,null,"Oaxaca","20","Zimatlán de Álvarez","570"]
[null,null,null,null,null,null,null,null,null,"Puebla","21","Acajete","001"]
[null,null,null,null,null,null,null,null,null,"Puebla","21","Acateno","002"]
[null,null,null,null,null,null,null,null,null,"Puebla","21","Acatlán","003"]
[null,null,null,null,null,null,null,null,null,"Puebla","21","Acatzingo","004"]
[null,null,null,null,null,null,null,null,null,"Puebla","21","Acteopan","005"]
[null,null,null,null,null,null,null,null,null,"Puebla","21","Ahuacatlán","006"]
[null,null,null,null,null,null,null,null,null,"Puebla","21","Ahuatlán","007"]
[null,null,null,null,null,null,null,null,null,"Puebla","21","Ahuazotepec","008"]
[null,null,null,null,null,null,null,null,null,"Puebla","21","Ahuehuetitla","009"]
[null,null,null,null,null,null,null,null,null,"Puebla","21","Ajalpan","010"]
[null,null,null,null,null,null,null,null,null,"Puebla","21","Albino Zertuche","011"]
[null,null,null,null,null,null,null,null,null,"Puebla","21","Aljojuca","012"]
[null,null,null,null,null,null,null,null,null,"Puebla","21","Altepexi","013"]
[null,null,null,null,null,null,null,null,null,"Puebla","21","Amixtlán","014"]
[null,null,null,null,null,null,null,null,null,"Puebla","21","Amozoc","015"]
[null,null,null,null,null,null,null,null,null,"Puebla","21","Aquixtla","016"]
[null,null,null,null,null,null,null,null,null,"Puebla","21","Atempan","017"]
[null,null,null,null,null,null,null,null,null,"Puebla","21","Atexcal","018"]
[null,null,null,null,null,null,null,null,null,"Puebla","21","Atlixco","019"]
[null,null,null,null,null,null,null,null,null,"Puebla","21","Atoyatempan","020"]
[null,null,null,null,null,null,null,null,null,"Puebla","21","Atzala","021"]
[null,null,null,null,null,null,null,null,null,"Puebla","21","Atzitzihuacán","022"]
[null,null,null,null,null,null,null,null,null,"Puebla","21","Atzitzintla","023"]
[null,null,null,null,null,null,null,null,null,"Puebla","21","Axutla","024"]
[null,null,null,null,null,null,null,null,null,"Puebla","21","Ayotoxco de Guerrero","025"]
[null,null,null,null,null,null,null,null,null,"Puebla","21","Calpan","026"]
[null,null,null,null,null,null,null,null,null,"Puebla","21","Caltepec","027"]
[null,null,null,null,null,null,null,null,null,"Puebla","21","Camocuautla","028"]
[null,null,null,null,null,null,null,null,null,"Puebla","21","Caxhuacan","029"]
[null,null,null,null,null,null,null,null,null,"Puebla","21","Coatepec","030"]
[null,null,null,null,null,null,null,null,null,"Puebla","21","Coatzingo","031"]
[null,null,null,null,null,null,null,null,null,"Puebla","21","Cohetzala","032"]
[null,null,null,null,null,null,null,null,null,"Puebla","21","Cohuecan","033"]
[null,null,null,null,null,null,null,null,null,"Puebla","21","Coronango","034"]
[null,null,null,null,null,null,null,null,null,"Puebla","21","Coxcatlán","035"]
[null,null,null,null,null,null,null,null,null,"Puebla","21","Coyomeapan","036"]
[null,null,null,null,null,null,null,null,null,"Puebla","21","Coyotepec","037"]
[null,null,null,null,null,null,null,null,null,"Puebla","21","Cuapiaxtla de Madero","038"]
[null,null,null,null,null,null,null,null,null,"Puebla","21","Cuautempan","039"]
[null,null,null,null,null,null,null,null,null,"Puebla","21","Cuautinchán","040"]
[null,null,null,null,null,null,null,null,null,"Puebla","21","Cuautlancingo","041"]
[null,null,null,null,null,null,null,null,null,"Puebla","21","Cuayuca de Andrade","042"]
[null,null,null,null,null,null,null,null,null,"Puebla","21","Cuetzalan del Progreso","043"]
[null,null,null,null,null,null,null,null,null,"Puebla","21","Cuyoaco","044"]
[null,null,null,null,null,null,null,null,null,"Puebla","21","Chalchicomula de Sesma","045"]
[null,null,null,null,null,null,null,null,null,"Puebla","21","Chapulco","046"]
[null,null,null,null,null,null,null,null,null,"Puebla","21","Chiautla","047"]
[null,null,null,null,null,null,null,null,null,"Puebla","21","Chiautzingo","048"]
[null,null,null,null,null,null,null,null,null,"Puebla","21","Chiconcuautla","049"]
[null,null,null,null,null,null,null,null,null,"Puebla","21","Chichiquila","050"]
[null,null,null,null,null,null,null,null,null,"Puebla","21","Chietla","051"]
[null,null,null,null,null,null,null,null,null,"Puebla","21","Chigmecatitlán","052"]
[null,null,null,null,null,null,null,null,null,"Puebla","21","Chignahuapan","053"]
[null,null,null,null,null,null,null,null,null,"Puebla","21","Chignautla","054"]
[null,null,null,null,null,null,null,null,null,"Puebla","21","Chila","055"]
[null,null,null,null,null,null,null,null,null,"Puebla","21","Chila de la Sal","056"]
[null,null,null,null,null,null,null,null,null,"Puebla","21","Honey","057"]
[null,null,null,null,null,null,null,null,null,"Puebla","21","Chilchotla","058"]
[null,null,null,null,null,null,null,null,null,"Puebla","21","Chinantla","059"]
[null,null,null,null,null,null,null,null,null,"Puebla","21","Domingo Arenas","060"]
[null,null,null,null,null,null,null,null,null,"Puebla","21","Eloxochitlán","061"]
[null,null,null,null,null,null,null,null,null,"Puebla","21","Epatlán","062"]
[null,null,null,null,null,null,null,null,null,"Puebla","21","Esperanza","063"]
[null,null,null,null,null,null,null,null,null,"Puebla","21","Francisco Z. Mena","064"]
[null,null,null,null,null,null,null,null,null,"Puebla","21","General Felipe Ángeles","065"]
[null,null,null,null,null,null,null,null,null,"Puebla","21","Guadalupe","066"]
[null,null,null,null,null,null,null,null,null,"Puebla","21","Guadalupe Victoria","067"]
[null,null,null,null,null,null,null,null,null,"Puebla","21","Hermenegildo Galeana","068"]
[null,null,null,null,null,null,null,null,null,"Puebla","21","Huaquechula","069"]
[null,null,null,null,null,null,null,null,null,"Puebla","21","Huatlatlauca","070"]
[null,null,null,null,null,null,null,null,null,"Puebla","21","Huauchinango","071"]
[null,null,null,null,null,null,null,null,null,"Puebla","21","Huehuetla","072"]
[null,null,null,null,null,null,null,null,null,"Puebla","21","Huehuetlán el Chico","073"]
[null,null,null,null,null,null,null,null,null,"Puebla","21","Huejotzingo","074"]
[null,null,null,null,null,null,null,null,null,"Puebla","21","Hueyapan","075"]
[null,null,null,null,null,null,null,null,null,"Puebla","21","Hueytamalco","076"]
[null,null,null,null,null,null,null,null,null,"Puebla","21","Hueytlalpan","077"]
[null,null,null,null,null,null,null,null,null,"Puebla","21","Huitzilan de Serdán","078"]
[null,null,null,null,null,null,null,null,null,"Puebla","21","Huitziltepec","079"]
[null,null,null,null,null,null,null,null,null,"Puebla","21","Atlequizayan","080"]
[null,null,null,null,null,null,null,null,null,"Puebla","21","Ixcamilpa de Guerrero","081"]
[null,null,null,null,null,null,null,null,null,"Puebla","21","Ixcaquixtla","082"]
[null,null,null,null,null,null,null,null,null,"Puebla","21","Ixtacamaxtitlán","083"]
[null,null,null,null,null,null,null,null,null,"Puebla","21","Ixtepec","084"]
[null,null,null,null,null,null,null,null,null,"Puebla","21","Izúcar de Matamoros","085"]
[null,null,null,null,null,null,null,null,null,"Puebla","21","Jalpan","086"]
[null,null,null,null,null,null,null,null,null,"Puebla","21","Jolalpan","087"]
[null,null,null,null,null,null,null,null,null,"Puebla","21","Jonotla","088"]
[null,null,null,null,null,null,null,null,null,"Puebla","21","Jopala","089"]
[null,null,null,null,null,null,null,null,null,"Puebla","21","Juan C. Bonilla","090"]
[null,null,null,null,null,null,null,null,null,"Puebla","21","Juan Galindo","091"]
[null,null,null,null,null,null,null,null,null,"Puebla","21","Juan N. Méndez","092"]
[null,null,null,null,null,null,null,null,null,"Puebla","21","Lafragua","093"]
[null,null,null,null,null,null,null,null,null,"Puebla","21","Libres","094"]
[null,null,null,null,null,null,null,null,null,"Puebla","21","La Magdalena Tlatlauquitepec","095"]
[null,null,null,null,null,null,null,null,null,"Puebla","21","Mazapiltepec de Juárez","096"]
[null,null,null,null,null,null,null,null,null,"Puebla","21","Mixtla","097"]
[null,null,null,null,null,null,null,null,null,"Puebla","21","Molcaxac","098"]
[null,null,null,null,null,null,null,null,null,"Puebla","21","Cañada Morelos","099"]
[null,null,null,null,null,null,null,null,null,"Puebla","21","Naupan","100"]
[null,null,null,null,null,null,null,null,null,"Puebla","21","Nauzontla","101"]
[null,null,null,null,null,null,null,null,null,"Puebla","21","Nealtican","102"]
[null,null,null,null,null,null,null,null,null,"Puebla","21","Nicolás Bravo","103"]
[null,null,null,null,null,null,null,null,null,"Puebla","21","Nopalucan","104"]
[null,null,null,null,null,null,null,null,null,"Puebla","21","Ocotepec","105"]
[null,null,null,null,null,null,null,null,null,"Puebla","21","Ocoyucan","106"]
[null,null,null,null,null,null,null,null,null,"Puebla","21","Olintla","107"]
[null,null,null,null,null,null,null,null,null,"Puebla","21","Oriental","108"]
[null,null,null,null,null,null,null,null,null,"Puebla","21","Pahuatlán","109"]
[null,null,null,null,null,null,null,null,null,"Puebla","21","Palmar de Bravo","110"]
[null,null,null,null,null,null,null,null,null,"Puebla","21","Pantepec","111"]
[null,null,null,null,null,null,null,null,null,"Puebla","21","Petlalcingo","112"]
[null,null,null,null,null,null,null,null,null,"Puebla","21","Piaxtla","113"]
[null,null,null,null,null,null,null,null,null,"Puebla","21","Puebla","114"]
[null,null,null,null,null,null,null,null,null,"Puebla","21","Quecholac","115"]
[null,null,null,null,null,null,null,null,null,"Puebla","21","Quimixtlán","116"]
[null,null,null,null,null,null,null,null,null,"Puebla","21","Rafael Lara Grajales","117"]
[null,null,null,null,null,null,null,null,null,"Puebla","21","Los Reyes de Juárez","118"]
[null,null,null,null,null,null,null,null,null,"Puebla","21","San Andrés Cholula","119"]
[null,null,null,null,null,null,null,null,null,"Puebla","21","San Antonio Cañada","120"]
[null,null,null,null,null,null,null,null,null,"Puebla","21","San Diego la Mesa Tochimiltzingo","121"]
[null,null,null,null,null,null,null,null,null,"Puebla","21","San Felipe Teotlalcingo","122"]
[null,null,null,null,null,null,null,null,null,"Puebla","21","San Felipe Tepatlán","123"]
[null,null,null,null,null,null,null,null,null,"Puebla","21","San Gabriel Chilac","124"]
[null,null,null,null,null,null,null,null,null,"Puebla","21","San Gregorio Atzompa","125"]
[null,null,null,null,null,null,null,null,null,"Puebla","21","San Jerónimo Tecuanipan","126"]
[null,null,null,null,null,null,null,null,null,"Puebla","21","San Jerónimo Xayacatlán","127"]
[null,null,null,null,null,null,null,null,null,"Puebla","21","San José Chiapa","128"]
[null,null,null,null,null,null,null,null,null,"Puebla","21","San José Miahuatlán","129"]
[null,null,null,null,null,null,null,null,null,"Puebla","21","San Juan Atenco","130"]
[null,null,null,null,null,null,null,null,null,"Puebla","21","San Juan Atzompa","131"]
[null,null,null,null,null,null,null,null,null,"Puebla","21","San Martín Texmelucan","132"]
[null,null,null,null,null,null,null,null,null,"Puebla","21","San Martín Totoltepec","133"]
[null,null,null,null,null,null,null,null,null,"Puebla","21","San Matías Tlalancaleca","134"]
[null,null,null,null,null,null,null,null,null,"Puebla","21","San Miguel Ixitlán","135"]
[null,null,null,null,null,null,null,null,null,"Puebla","21","San Miguel Xoxtla","136"]
[null,null,null,null,null,null,null,null,null,"Puebla","21","San Nicolás Buenos Aires","137"]
[null,null,null,null,null,null,null,null,null,"Puebla","21","San Nicolás de los Ranchos","138"]
[null,null,null,null,null,null,null,null,null,"Puebla","21","San Pablo Anicano","139"]
[null,null,null,null,null,null,null,null,null,"Puebla","21","San Pedro Cholula","140"]
[null,null,null,null,null,null,null,null,null,"Puebla","21","San Pedro Yeloixtlahuaca","141"]
[null,null,null,null,null,null,null,null,null,"Puebla","21","San Salvador el Seco","142"]
[null,null,null,null,null,null,null,null,null,"Puebla","21","San Salvador el Verde","143"]
[null,null,null,null,null,null,null,null,null,"Puebla","21","San Salvador Huixcolotla","144"]
[null,null,null,null,null,null,null,null,null,"Puebla","21","San Sebastián Tlacotepec","145"]
[null,null,null,null,null,null,null,null,null,"Puebla","21","Santa Catarina Tlaltempan","146"]
[null,null,null,null,null,null,null,null,null,"Puebla","21","Santa Inés Ahuatempan","147"]
[null,null,null,null,null,null,null,null,null,"Puebla","21","Santa Isabel Cholula","148"]
[null,null,null,null,null,null,null,null,null,"Puebla","21","Santiago Miahuatlán","149"]
[null,null,null,null,null,null,null,null,null,"Puebla","21","Huehuetlán el Grande","150"]
[null,null,null,null,null,null,null,null,null,"Puebla","21","Santo Tomás Hueyotlipan","151"]
[null,null,null,null,null,null,null,null,null,"Puebla","21","Soltepec","152"]
[null,null,null,null,null,null,null,null,null,"Puebla","21","Tecali de Herrera","153"]
[null,null,null,null,null,null,null,null,null,"Puebla","21","Tecamachalco","154"]
[null,null,null,null,null,null,null,null,null,"Puebla","21","Tecomatlán","155"]
[null,null,null,null,null,null,null,null,null,"Puebla","21","Tehuacán","156"]
[null,null,null,null,null,null,null,null,null,"Puebla","21","Tehuitzingo","157"]
[null,null,null,null,null,null,null,null,null,"Puebla","21","Tenampulco","158"]
[null,null,null,null,null,null,null,null,null,"Puebla","21","Teopantlán","159"]
[null,null,null,null,null,null,null,null,null,"Puebla","21","Teotlalco","160"]
[null,null,null,null,null,null,null,null,null,"Puebla","21","Tepanco de López","161"]
[null,null,null,null,null,null,null,null,null,"Puebla","21","Tepango de Rodríguez","162"]
[null,null,null,null,null,null,null,null,null,"Puebla","21","Tepatlaxco de Hidalgo","163"]
[null,null,null,null,null,null,null,null,null,"Puebla","21","Tepeaca","164"]
[null,null,null,null,null,null,null,null,null,"Puebla","21","Tepemaxalco","165"]
[null,null,null,null,null,null,null,null,null,"Puebla","21","Tepeojuma","166"]
[null,null,null,null,null,null,null,null,null,"Puebla","21","Tepetzintla","167"]
[null,null,null,null,null,null,null,null,null,"Puebla","21","Tepexco","168"]
[null,null,null,null,null,null,null,null,null,"Puebla","21","Tepexi de Rodríguez","169"]
[null,null,null,null,null,null,null,null,null,"Puebla","21","Tepeyahualco","170"]
[null,null,null,null,null,null,null,null,null,"Puebla","21","Tepeyahualco de Cuauhtémoc","171"]
[null,null,null,null,null,null,null,null,null,"Puebla","21","Tetela de Ocampo","172"]
[null,null,null,null,null,null,null,null,null,"Puebla","21","Teteles de Ávila Castillo","173"]
[null,null,null,null,null,null,null,null,null,"Puebla","21","Teziutlán","174"]
[null,null,null,null,null,null,null,null,null,"Puebla","21","Tianguismanalco","175"]
[null,null,null,null,null,null,null,null,null,"Puebla","21","Tilapa","176"]
[null,null,null,null,null,null,null,null,null,"Puebla","21","Tlacotepec de Benito Juárez","177"]
[null,null,null,null,null,null,null,null,null,"Puebla","21","Tlacuilotepec","178"]
[null,null,null,null,null,null,null,null,null,"Puebla","21","Tlachichuca","179"]
[null,null,null,null,null,null,null,null,null,"Puebla","21","Tlahuapan","180"]
[null,null,null,null,null,null,null,null,null,"Puebla","21","Tlaltenango","181"]
[null,null,null,null,null,null,null,null,null,"Puebla","21","Tlanepantla","182"]
[null,null,null,null,null,null,null,null,null,"Puebla","21","Tlaola","183"]
[null,null,null,null,null,null,null,null,null,"Puebla","21","Tlapacoya","184"]
[null,null,null,null,null,null,null,null,null,"Puebla","21","Tlapanalá","185"]
[null,null,null,null,null,null,null,null,null,"Puebla","21","Tlatlauquitepec","186"]
[null,null,null,null,null,null,null,null,null,"Puebla","21","Tlaxco","187"]
[null,null,null,null,null,null,null,null,null,"Puebla","21","Tochimilco","188"]
[null,null,null,null,null,null,null,null,null,"Puebla","21","Tochtepec","189"]
[null,null,null,null,null,null,null,null,null,"Puebla","21","Totoltepec de Guerrero","190"]
[null,null,null,null,null,null,null,null,null,"Puebla","21","Tulcingo","191"]
[null,null,null,null,null,null,null,null,null,"Puebla","21","Tuzamapan de Galeana","192"]
[null,null,null,null,null,null,null,null,null,"Puebla","21","Tzicatlacoyan","193"]
[null,null,null,null,null,null,null,null,null,"Puebla","21","Venustiano Carranza","194"]
[null,null,null,null,null,null,null,null,null,"Puebla","21","Vicente Guerrero","195"]
[null,null,null,null,null,null,null,null,null,"Puebla","21","Xayacatlán de Bravo","196"]
[null,null,null,null,null,null,null,null,null,"Puebla","21","Xicotepec","197"]
[null,null,null,null,null,null,null,null,null,"Puebla","21","Xicotlán","198"]
[null,null,null,null,null,null,null,null,null,"Puebla","21","Xiutetelco","199"]
[null,null,null,null,null,null,null,null,null,"Puebla","21","Xochiapulco","200"]
[null,null,null,null,null,null,null,null,null,"Puebla","21","Xochiltepec","201"]
[null,null,null,null,null,null,null,null,null,"Puebla","21","Xochitlán de Vicente Suárez","202"]
[null,null,null,null,null,null,null,null,null,"Puebla","21","Xochitlán Todos Santos","203"]
[null,null,null,null,null,null,null,null,null,"Puebla","21","Yaonáhuac","204"]
[null,null,null,null,null,null,null,null,null,"Puebla","21","Yehualtepec","205"]
[null,null,null,null,null,null,null,null,null,"Puebla","21","Zacapala","206"]
[null,null,null,null,null,null,null,null,null,"Puebla","21","Zacapoaxtla","207"]
[null,null,null,null,null,null,null,null,null,"Puebla","21","Zacatlán","208"]
[null,null,null,null,null,null,null,null,null,"Puebla","21","Zapotitlán","209"]
[null,null,null,null,null,null,null,null,null,"Puebla","21","Zapotitlán de Méndez","210"]
[null,null,null,null,null,null,null,null,null,"Puebla","21","Zaragoza","211"]
[null,null,null,null,null,null,null,null,null,"Puebla","21","Zautla","212"]
[null,null,null,null,null,null,null,null,null,"Puebla","21","Zihuateutla","213"]
[null,null,null,null,null,null,null,null,null,"Puebla","21","Zinacatepec","214"]
[null,null,null,null,null,null,null,null,null,"Puebla","21","Zongozotla","215"]
[null,null,null,null,null,null,null,null,null,"Puebla","21","Zoquiapan","216"]
[null,null,null,null,null,null,null,null,null,"Puebla","21","Zoquitlán","217"]
[null,null,null,null,null,null,null,null,null,"Querétaro","22","Amealco de Bonfil","001"]
[null,null,null,null,null,null,null,null,null,"Querétaro","22","Pinal de Amoles","002"]
[null,null,null,null,null,null,null,null,null,"Querétaro","22","Arroyo Seco","003"]
[null,null,null,null,null,null,null,null,null,"Querétaro","22","Cadereyta de Montes","004"]
[null,null,null,null,null,null,null,null,null,"Querétaro","22","Colón","005"]
[null,null,null,null,null,null,null,null,null,"Querétaro","22","Corregidora","006"]
[null,null,null,null,null,null,null,null,null,"Querétaro","22","Ezequiel Montes","007"]
[null,null,null,null,null,null,null,null,null,"Querétaro","22","Huimilpan","008"]
[null,null,null,null,null,null,null,null,null,"Querétaro","22","Jalpan de Serra","009"]
[null,null,null,null,null,null,null,null,null,"Querétaro","22","Landa de Matamoros","010"]
[null,null,null,null,null,null,null,null,null,"Querétaro","22","El Marqués","011"]
[null,null,null,null,null,null,null,null,null,"Querétaro","22","Pedro Escobedo","012"]
[null,null,null,null,null,null,null,null,null,"Querétaro","22","Peñamiller","013"]
[null,null,null,null,null,null,null,null,null,"Querétaro","22","Querétaro","014"]
[null,null,null,null,null,null,null,null,null,"Querétaro","22","San Joaquín","015"]
[null,null,null,null,null,null,null,null,null,"Querétaro","22","San Juan del Río","016"]
[null,null,null,null,null,null,null,null,null,"Querétaro","22","Tequisquiapan","017"]
[null,null,null,null,null,null,null,null,null,"Querétaro","22","Tolimán","018"]
[null,null,null,null,null,null,null,null,null,"Quintana Roo","23","Cozumel","001"]
[null,null,null,null,null,null,null,null,null,"Quintana Roo","23","Felipe Carrillo Puerto","002"]
[null,null,null,null,null,null,null,null,null,"Quintana Roo","23","Isla Mujeres","003"]
[null,null,null,null,null,null,null,null,null,"Quintana Roo","23","Othón P. Blanco","004"]
[null,null,null,null,null,null,null,null,null,"Quintana Roo","23","Benito Juárez","005"]
[null,null,null,null,null,null,null,null,null,"Quintana Roo","23","José María Morelos","006"]
[null,null,null,null,null,null,null,null,null,"Quintana Roo","23","Lázaro Cárdenas","007"]
[null,null,null,null,null,null,null,null,null,"Quintana Roo","23","Solidaridad","008"]
[null,null,null,null,null,null,null,null,null,"Quintana Roo","23","Tulum","009"]
[null,null,null,null,null,null,null,null,null,"Quintana Roo","23","Bacalar","010"]
[null,null,null,null,null,null,null,null,null,"Quintana Roo","23","Puerto Morelos","011"]
[null,null,null,null,null,null,null,null,null,"San Luis Potosí","24","Ahualulco del Sonido 13","001"]
[null,null,null,null,null,null,null,null,null,"San Luis Potosí","24","Alaquines","002"]
[null,null,null,null,null,null,null,null,null,"San Luis Potosí","24","Aquismón","003"]
[null,null,null,null,null,null,null,null,null,"San Luis Potosí","24","Armadillo de los Infante","004"]
[null,null,null,null,null,null,null,null,null,"San Luis Potosí","24","Cárdenas","005"]
[null,null,null,null,null,null,null,null,null,"San Luis Potosí","24","Catorce","006"]
[null,null,null,null,null,null,null,null,null,"San Luis Potosí","24","Cedral","007"]
[null,null,null,null,null,null,null,null,null,"San Luis Potosí","24","Cerritos","008"]
[null,null,null,null,null,null,null,null,null,"San Luis Potosí","24","Cerro de San Pedro","009"]
[null,null,null,null,null,null,null,null,null,"San Luis Potosí","24","Ciudad del Maíz","010"]
[null,null,null,null,null,null,null,null,null,"San Luis Potosí","24","Ciudad Fernández","011"]
[null,null,null,null,null,null,null,null,null,"San Luis Potosí","24","Tancanhuitz","012"]
[null,null,null,null,null,null,null,null,null,"San Luis Potosí","24","Ciudad Valles","013"]
[null,null,null,null,null,null,null,null,null,"San Luis Potosí","24","Coxcatlán","014"]
[null,null,null,null,null,null,null,null,null,"San Luis Potosí","24","Charcas","015"]
[null,null,null,null,null,null,null,null,null,"San Luis Potosí","24","Ebano","016"]
[null,null,null,null,null,null,null,null,null,"San Luis Potosí","24","Guadalcázar","017"]
[null,null,null,null,null,null,null,null,null,"San Luis Potosí","24","Huehuetlán","018"]
[null,null,null,null,null,null,null,null,null,"San Luis Potosí","24","Lagunillas","019"]
[null,null,null,null,null,null,null,null,null,"San Luis Potosí","24","Matehuala","020"]
[null,null,null,null,null,null,null,null,null,"San Luis Potosí","24","Mexquitic de Carmona","021"]
[null,null,null,null,null,null,null,null,null,"San Luis Potosí","24","Moctezuma","022"]
[null,null,null,null,null,null,null,null,null,"San Luis Potosí","24","Rayón","023"]
[null,null,null,null,null,null,null,null,null,"San Luis Potosí","24","Rioverde","024"]
[null,null,null,null,null,null,null,null,null,"San Luis Potosí","24","Salinas","025"]
[null,null,null,null,null,null,null,null,null,"San Luis Potosí","24","San Antonio","026"]
[null,null,null,null,null,null,null,null,null,"San Luis Potosí","24","San Ciro de Acosta","027"]
[null,null,null,null,null,null,null,null,null,"San Luis Potosí","24","San Luis Potosí","028"]
[null,null,null,null,null,null,null,null,null,"San Luis Potosí","24","San Martín Chalchicuautla","029"]
[null,null,null,null,null,null,null,null,null,"San Luis Potosí","24","San Nicolás Tolentino","030"]
[null,null,null,null,null,null,null,null,null,"San Luis Potosí","24","Santa Catarina","031"]
[null,null,null,null,null,null,null,null,null,"San Luis Potosí","24","Santa María del Río","032"]
[null,null,null,null,null,null,null,null,null,"San Luis Potosí","24","Santo Domingo","033"]
[null,null,null,null,null,null,null,null,null,"San Luis Potosí","24","San Vicente Tancuayalab","034"]
[null,null,null,null,null,null,null,null,null,"San Luis Potosí","24","Soledad de Graciano Sánchez","035"]
[null,null,null,null,null,null,null,null,null,"San Luis Potosí","24","Tamasopo","036"]
[null,null,null,null,null,null,null,null,null,"San Luis Potosí","24","Tamazunchale","037"]
[null,null,null,null,null,null,null,null,null,"San Luis Potosí","24","Tampacán","038"]
[null,null,null,null,null,null,null,null,null,"San Luis Potosí","24","Tampamolón Corona","039"]
[null,null,null,null,null,null,null,null,null,"San Luis Potosí","24","Tamuín","040"]
[null,null,null,null,null,null,null,null,null,"San Luis Potosí","24","Tanlajás","041"]
[null,null,null,null,null,null,null,null,null,"San Luis Potosí","24","Tanquián de Escobedo","042"]
[null,null,null,null,null,null,null,null,null,"San Luis Potosí","24","Tierra Nueva","043"]
[null,null,null,null,null,null,null,null,null,"San Luis Potosí","24","Vanegas","044"]
[null,null,null,null,null,null,null,null,null,"San Luis Potosí","24","Venado","045"]
[null,null,null,null,null,null,null,null,null,"San Luis Potosí","24","Villa de Arriaga","046"]
[null,null,null,null,null,null,null,null,null,"San Luis Potosí","24","Villa de Guadalupe","047"]
[null,null,null,null,null,null,null,null,null,"San Luis Potosí","24","Villa de la Paz","048"]
[null,null,null,null,null,null,null,null,null,"San Luis Potosí","24","Villa de Ramos","049"]
[null,null,null,null,null,null,null,null,null,"San Luis Potosí","24","Villa de Reyes","050"]
[null,null,null,null,null,null,null,null,null,"San Luis Potosí","24","Villa Hidalgo","051"]
[null,null,null,null,null,null,null,null,null,"San Luis Potosí","24","Villa Juárez","052"]
[null,null,null,null,null,null,null,null,null,"San Luis Potosí","24","Axtla de Terrazas","053"]
[null,null,null,null,null,null,null,null,null,"San Luis Potosí","24","Xilitla","054"]
[null,null,null,null,null,null,null,null,null,"San Luis Potosí","24","Zaragoza","055"]
[null,null,null,null,null,null,null,null,null,"San Luis Potosí","24","Villa de Arista","056"]
[null,null,null,null,null,null,null,null,null,"San Luis Potosí","24","Matlapa","057"]
[null,null,null,null,null,null,null,null,null,"San Luis Potosí","24","El Naranjo","058"]
[null,null,null,null,null,null,null,null,null,"Sinaloa","25","Ahome","001"]
[null,null,null,null,null,null,null,null,null,"Sinaloa","25","Angostura","002"]
[null,null,null,null,null,null,null,null,null,"Sinaloa","25","Badiraguato","003"]
[null,null,null,null,null,null,null,null,null,"Sinaloa","25","Concordia","004"]
[null,null,null,null,null,null,null,null,null,"Sinaloa","25","Cosalá","005"]
[null,null,null,null,null,null,null,null,null,"Sinaloa","25","Culiacán","006"]
[null,null,null,null,null,null,null,null,null,"Sinaloa","25","Choix","007"]
[null,null,null,null,null,null,null,null,null,"Sinaloa","25","Elota","008"]
[null,null,null,null,null,null,null,null,null,"Sinaloa","25","Escuinapa","009"]
[null,null,null,null,null,null,null,null,null,"Sinaloa","25","El Fuerte","010"]
[null,null,null,null,null,null,null,null,null,"Sinaloa","25","Guasave","011"]
[null,null,null,null,null,null,null,null,null,"Sinaloa","25","Mazatlán","012"]
[null,null,null,null,null,null,null,null,null,"Sinaloa","25","Mocorito","013"]
[null,null,null,null,null,null,null,null,null,"Sinaloa","25","Rosario","014"]
[null,null,null,null,null,null,null,null,null,"Sinaloa","25","Salvador Alvarado","015"]
[null,null,null,null,null,null,null,null,null,"Sinaloa","25","San Ignacio","016"]
[null,null,null,null,null,null,null,null,null,"Sinaloa","25","Sinaloa","017"]
[null,null,null,null,null,null,null,null,null,"Sinaloa","25","Navolato","018"]
[null,null,null,null,null,null,null,null,null,"Sonora","26","Aconchi","001"]
[null,null,null,null,null,null,null,null,null,"Sonora","26","Agua Prieta","002"]
[null,null,null,null,null,null,null,null,null,"Sonora","26","Álamos","003"]
[null,null,null,null,null,null,null,null,null,"Sonora","26","Altar","004"]
[null,null,null,null,null,null,null,null,null,"Sonora","26","Arivechi","005"]
[null,null,null,null,null,null,null,null,null,"Sonora","26","Arizpe","006"]
[null,null,null,null,null,null,null,null,null,"Sonora","26","Atil","007"]
[null,null,null,null,null,null,null,null,null,"Sonora","26","Bacadéhuachi","008"]
[null,null,null,null,null,null,null,null,null,"Sonora","26","Bacanora","009"]
[null,null,null,null,null,null,null,null,null,"Sonora","26","Bacerac","010"]
[null,null,null,null,null,null,null,null,null,"Sonora","26","Bacoachi","011"]
[null,null,null,null,null,null,null,null,null,"Sonora","26","Bácum","012"]
[null,null,null,null,null,null,null,null,null,"Sonora","26","Banámichi","013"]
[null,null,null,null,null,null,null,null,null,"Sonora","26","Baviácora","014"]
[null,null,null,null,null,null,null,null,null,"Sonora","26","Bavispe","015"]
[null,null,null,null,null,null,null,null,null,"Sonora","26","Benjamín Hill","016"]
[null,null,null,null,null,null,null,null,null,"Sonora","26","Caborca","017"]
[null,null,null,null,null,null,null,null,null,"Sonora","26","Cajeme","018"]
[null,null,null,null,null,null,null,null,null,"Sonora","26","Cananea","019"]
[null,null,null,null,null,null,null,null,null,"Sonora","26","Carbó","020"]
[null,null,null,null,null,null,null,null,null,"Sonora","26","La Colorada","021"]
[null,null,null,null,null,null,null,null,null,"Sonora","26","Cucurpe","022"]
[null,null,null,null,null,null,null,null,null,"Sonora","26","Cumpas","023"]
[null,null,null,null,null,null,null,null,null,"Sonora","26","Divisaderos","024"]
[null,null,null,null,null,null,null,null,null,"Sonora","26","Empalme","025"]
[null,null,null,null,null,null,null,null,null,"Sonora","26","Etchojoa","026"]
[null,null,null,null,null,null,null,null,null,"Sonora","26","Fronteras","027"]
[null,null,null,null,null,null,null,null,null,"Sonora","26","Granados","028"]
[null,null,null,null,null,null,null,null,null,"Sonora","26","Guaymas","029"]
[null,null,null,null,null,null,null,null,null,"Sonora","26","Hermosillo","030"]
[null,null,null,null,null,null,null,null,null,"Sonora","26","Huachinera","031"]
[null,null,null,null,null,null,null,null,null,"Sonora","26","Huásabas","032"]
[null,null,null,null,null,null,null,null,null,"Sonora","26","Huatabampo","033"]
[null,null,null,null,null,null,null,null,null,"Sonora","26","Huépac","034"]
[null,null,null,null,null,null,null,null,null,"Sonora","26","Imuris","035"]
[null,null,null,null,null,null,null,null,null,"Sonora","26","Magdalena","036"]
[null,null,null,null,null,null,null,null,null,"Sonora","26","Mazatán","037"]
[null,null,null,null,null,null,null,null,null,"Sonora","26","Moctezuma","038"]
[null,null,null,null,null,null,null,null,null,"Sonora","26","Naco","039"]
[null,null,null,null,null,null,null,null,null,"Sonora","26","Nácori Chico","040"]
[null,null,null,null,null,null,null,null,null,"Sonora","26","Nacozari de García","041"]
[null,null,null,null,null,null,null,null,null,"Sonora","26","Navojoa","042"]
[null,null,null,null,null,null,null,null,null,"Sonora","26","Nogales","043"]
[null,null,null,null,null,null,null,null,null,"Sonora","26","Ónavas","044"]
[null,null,null,null,null,null,null,null,null,"Sonora","26","Opodepe","045"]
[null,null,null,null,null,null,null,null,null,"Sonora","26","Oquitoa","046"]
[null,null,null,null,null,null,null,null,null,"Sonora","26","Pitiquito","047"]
[null,null,null,null,null,null,null,null,null,"Sonora","26","Puerto Peñasco","048"]
[null,null,null,null,null,null,null,null,null,"Sonora","26","Quiriego","049"]
[null,null,null,null,null,null,null,null,null,"Sonora","26","Rayón","050"]
[null,null,null,null,null,null,null,null,null,"Sonora","26","Rosario","051"]
[null,null,null,null,null,null,null,null,null,"Sonora","26","Sahuaripa","052"]
[null,null,null,null,null,null,null,null,null,"Sonora","26","San Felipe de Jesús","053"]
[null,null,null,null,null,null,null,null,null,"Sonora","26","San Javier","054"]
[null,null,null,null,null,null,null,null,null,"Sonora","26","San Luis Río Colorado","055"]
[null,null,null,null,null,null,null,null,null,"Sonora","26","San Miguel de Horcasitas","056"]
[null,null,null,null,null,null,null,null,null,"Sonora","26","San Pedro de la Cueva","057"]
[null,null,null,null,null,null,null,null,null,"Sonora","26","Santa Ana","058"]
[null,null,null,null,null,null,null,null,null,"Sonora","26","Santa Cruz","059"]
[null,null,null,null,null,null,null,null,null,"Sonora","26","Sáric","060"]
[null,null,null,null,null,null,null,null,null,"Sonora","26","Soyopa","061"]
[null,null,null,null,null,null,null,null,null,"Sonora","26","Suaqui Grande","062"]
[null,null,null,null,null,null,null,null,null,"Sonora","26","Tepache","063"]
[null,null,null,null,null,null,null,null,null,"Sonora","26","Trincheras","064"]
[null,null,null,null,null,null,null,null,null,"Sonora","26","Tubutama","065"]
[null,null,null,null,null,null,null,null,null,"Sonora","26","Ures","066"]
[null,null,null,null,null,null,null,null,null,"Sonora","26","Villa Hidalgo","067"]
[null,null,null,null,null,null,null,null,null,"Sonora","26","Villa Pesqueira","068"]
[null,null,null,null,null,null,null,null,null,"Sonora","26","Yécora","069"]
[null,null,null,null,null,null,null,null,null,"Sonora","26","General Plutarco Elías Calles","070"]
[null,null,null,null,null,null,null,null,null,"Sonora","26","Benito Juárez","071"]
[null,null,null,null,null,null,null,null,null,"Sonora","26","San Ignacio Río Muerto","072"]
[null,null,null,null,null,null,null,null,null,"Tabasco","27","Balancán","001"]
[null,null,null,null,null,null,null,null,null,"Tabasco","27","Cárdenas","002"]
[null,null,null,null,null,null,null,null,null,"Tabasco","27","Centla","003"]
[null,null,null,null,null,null,null,null,null,"Tabasco","27","Centro","004"]
[null,null,null,null,null,null,null,null,null,"Tabasco","27","Comalcalco","005"]
[null,null,null,null,null,null,null,null,null,"Tabasco","27","Cunduacán","006"]
[null,null,null,null,null,null,null,null,null,"Tabasco","27","Emiliano Zapata","007"]
[null,null,null,null,null,null,null,null,null,"Tabasco","27","Huimanguillo","008"]
[null,null,null,null,null,null,null,null,null,"Tabasco","27","Jalapa","009"]
[null,null,null,null,null,null,null,null,null,"Tabasco","27","Jalpa de Méndez","010"]
[null,null,null,null,null,null,null,null,null,"Tabasco","27","Jonuta","011"]
[null,null,null,null,null,null,null,null,null,"Tabasco","27","Macuspana","012"]
[null,null,null,null,null,null,null,null,null,"Tabasco","27","Nacajuca","013"]
[null,null,null,null,null,null,null,null,null,"Tabasco","27","Paraíso","014"]
[null,null,null,null,null,null,null,null,null,"Tabasco","27","Tacotalpa","015"]
[null,null,null,null,null,null,null,null,null,"Tabasco","27","Teapa","016"]
[null,null,null,null,null,null,null,null,null,"Tabasco","27","Tenosique","017"]
[null,null,null,null,null,null,null,null,null,"Tamaulipas","28","Abasolo","001"]
[null,null,null,null,null,null,null,null,null,"Tamaulipas","28","Aldama","002"]
[null,null,null,null,null,null,null,null,null,"Tamaulipas","28","Altamira","003"]
[null,null,null,null,null,null,null,null,null,"Tamaulipas","28","Antiguo Morelos","004"]
[null,null,null,null,null,null,null,null,null,"Tamaulipas","28","Burgos","005"]
[null,null,null,null,null,null,null,null,null,"Tamaulipas","28","Bustamante","006"]
[null,null,null,null,null,null,null,null,null,"Tamaulipas","28","Camargo","007"]
[null,null,null,null,null,null,null,null,null,"Tamaulipas","28","Casas","008"]
[null,null,null,null,null,null,null,null,null,"Tamaulipas","28","Ciudad Madero","009"]
[null,null,null,null,null,null,null,null,null,"Tamaulipas","28","Cruillas","010"]
[null,null,null,null,null,null,null,null,null,"Tamaulipas","28","Gómez Farías","011"]
[null,null,null,null,null,null,null,null,null,"Tamaulipas","28","González","012"]
[null,null,null,null,null,null,null,null,null,"Tamaulipas","28","Güémez","013"]
[null,null,null,null,null,null,null,null,null,"Tamaulipas","28","Guerrero","014"]
[null,null,null,null,null,null,null,null,null,"Tamaulipas","28","Gustavo Díaz Ordaz","015"]
[null,null,null,null,null,null,null,null,null,"Tamaulipas","28","Hidalgo","016"]
[null,null,null,null,null,null,null,null,null,"Tamaulipas","28","Jaumave","017"]
[null,null,null,null,null,null,null,null,null,"Tamaulipas","28","Jiménez","018"]
[null,null,null,null,null,null,null,null,null,"Tamaulipas","28","Llera","019"]
[null,null,null,null,null,null,null,null,null,"Tamaulipas","28","Mainero","020"]
[null,null,null,null,null,null,null,null,null,"Tamaulipas","28","El Mante","021"]
[null,null,null,null,null,null,null,null,null,"Tamaulipas","28","Matamoros","022"]
[null,null,null,null,null,null,null,null,null,"Tamaulipas","28","Méndez","023"]
[null,null,null,null,null,null,null,null,null,"Tamaulipas","28","Mier","024"]
[null,null,null,null,null,null,null,null,null,"Tamaulipas","28","Miguel Alemán","025"]
[null,null,null,null,null,null,null,null,null,"Tamaulipas","28","Miquihuana","026"]
[null,null,null,null,null,null,null,null,null,"Tamaulipas","28","Nuevo Laredo","027"]
[null,null,null,null,null,null,null,null,null,"Tamaulipas","28","Nuevo Morelos","028"]
[null,null,null,null,null,null,null,null,null,"Tamaulipas","28","Ocampo","029"]
[null,null,null,null,null,null,null,null,null,"Tamaulipas","28","Padilla","030"]
[null,null,null,null,null,null,null,null,null,"Tamaulipas","28","Palmillas","031"]
[null,null,null,null,null,null,null,null,null,"Tamaulipas","28","Reynosa","032"]
[null,null,null,null,null,null,null,null,null,"Tamaulipas","28","Río Bravo","033"]
[null,null,null,null,null,null,null,null,null,"Tamaulipas","28","San Carlos","034"]
[null,null,null,null,null,null,null,null,null,"Tamaulipas","28","San Fernando","035"]
[null,null,null,null,null,null,null,null,null,"Tamaulipas","28","San Nicolás","036"]
[null,null,null,null,null,null,null,null,null,"Tamaulipas","28","Soto la Marina","037"]
[null,null,null,null,null,null,null,null,null,"Tamaulipas","28","Tampico","038"]
[null,null,null,null,null,null,null,null,null,"Tamaulipas","28","Tula","039"]
[null,null,null,null,null,null,null,null,null,"Tamaulipas","28","Valle Hermoso","040"]
[null,null,null,null,null,null,null,null,null,"Tamaulipas","28","Victoria","041"]
[null,null,null,null,null,null,null,null,null,"Tamaulipas","28","Villagrán","042"]
[null,null,null,null,null,null,null,null,null,"Tamaulipas","28","Xicoténcatl","043"]
[null,null,null,null,null,null,null,null,null,"Tlaxcala","29","Amaxac de Guerrero","001"]
[null,null,null,null,null,null,null,null,null,"Tlaxcala","29","Apetatitlán de Antonio Carvajal","002"]
[null,null,null,null,null,null,null,null,null,"Tlaxcala","29","Atlangatepec","003"]
[null,null,null,null,null,null,null,null,null,"Tlaxcala","29","Atltzayanca","004"]
[null,null,null,null,null,null,null,null,null,"Tlaxcala","29","Apizaco","005"]
[null,null,null,null,null,null,null,null,null,"Tlaxcala","29","Calpulalpan","006"]
[null,null,null,null,null,null,null,null,null,"Tlaxcala","29","El Carmen Tequexquitla","007"]
[null,null,null,null,null,null,null,null,null,"Tlaxcala","29","Cuapiaxtla","008"]
[null,null,null,null,null,null,null,null,null,"Tlaxcala","29","Cuaxomulco","009"]
[null,null,null,null,null,null,null,null,null,"Tlaxcala","29","Chiautempan","010"]
[null,null,null,null,null,null,null,null,null,"Tlaxcala","29","Muñoz de Domingo Arenas","011"]
[null,null,null,null,null,null,null,null,null,"Tlaxcala","29","Españita","012"]
[null,null,null,null,null,null,null,null,null,"Tlaxcala","29","Huamantla","013"]
[null,null,null,null,null,null,null,null,null,"Tlaxcala","29","Hueyotlipan","014"]
[null,null,null,null,null,null,null,null,null,"Tlaxcala","29","Ixtacuixtla de Mariano Matamoros","015"]
[null,null,null,null,null,null,null,null,null,"Tlaxcala","29","Ixtenco","016"]
[null,null,null,null,null,null,null,null,null,"Tlaxcala","29","Mazatecochco de José María Morelos","017"]
[null,null,null,null,null,null,null,null,null,"Tlaxcala","29","Contla de Juan Cuamatzi","018"]
[null,null,null,null,null,null,null,null,null,"Tlaxcala","29","Tepetitla de Lardizábal","019"]
[null,null,null,null,null,null,null,null,null,"Tlaxcala","29","Sanctórum de Lázaro Cárdenas","020"]
[null,null,null,null,null,null,null,null,null,"Tlaxcala","29","Nanacamilpa de Mariano Arista","021"]
[null,null,null,null,null,null,null,null,null,"Tlaxcala","29","Acuamanala de Miguel Hidalgo","022"]
[null,null,null,null,null,null,null,null,null,"Tlaxcala","29","Natívitas","023"]
[null,null,null,null,null,null,null,null,null,"Tlaxcala","29","Panotla","024"]
[null,null,null,null,null,null,null,null,null,"Tlaxcala","29","San Pablo del Monte","025"]
[null,null,null,null,null,null,null,null,null,"Tlaxcala","29","Santa Cruz Tlaxcala","026"]
[null,null,null,null,null,null,null,null,null,"Tlaxcala","29","Tenancingo","027"]
[null,null,null,null,null,null,null,null,null,"Tlaxcala","29","Teolocholco","028"]
[null,null,null,null,null,null,null,null,null,"Tlaxcala","29","Tepeyanco","029"]
[null,null,null,null,null,null,null,null,null,"Tlaxcala","29","Terrenate","030"]
[null,null,null,null,null,null,null,null,null,"Tlaxcala","29","Tetla de la Solidaridad","031"]
[null,null,null,null,null,null,null,null,null,"Tlaxcala","29","Tetlatlahuca","032"]
[null,null,null,null,null,null,null,null,null,"Tlaxcala","29","Tlaxcala","033"]
[null,null,null,null,null,null,null,null,null,"Tlaxcala","29","Tlaxco","034"]
[null,null,null,null,null,null,null,null,null,"Tlaxcala","29","Tocatlán","035"]
[null,null,null,null,null,null,null,null,null,"Tlaxcala","29","Totolac","036"]
[null,null,null,null,null,null,null,null,null,"Tlaxcala","29","Ziltlaltépec de Trinidad Sánchez Santos","037"]
[null,null,null,null,null,null,null,null,null,"Tlaxcala","29","Tzompantepec","038"]
[null,null,null,null,null,null,null,null,null,"Tlaxcala","29","Xaloztoc","039"]
[null,null,null,null,null,null,null,null,null,"Tlaxcala","29","Xaltocan","040"]
[null,null,null,null,null,null,null,null,null,"Tlaxcala","29","Papalotla de Xicohténcatl","041"]
[null,null,null,null,null,null,null,null,null,"Tlaxcala","29","Xicohtzinco","042"]
[null,null,null,null,null,null,null,null,null,"Tlaxcala","29","Yauhquemehcan","043"]
[null,null,null,null,null,null,null,null,null,"Tlaxcala","29","Zacatelco","044"]
[null,null,null,null,null,null,null,null,null,"Tlaxcala","29","Benito Juárez","045"]
[null,null,null,null,null,null,null,null,null,"Tlaxcala","29","Emiliano Zapata","046"]
[null,null,null,null,null,null,null,null,null,"Tlaxcala","29","Lázaro Cárdenas","047"]
[null,null,null,null,null,null,null,null,null,"Tlaxcala","29","La Magdalena Tlaltelulco","048"]
[null,null,null,null,null,null,null,null,null,"Tlaxcala","29","San Damián Texóloc","049"]
[null,null,null,null,null,null,null,null,null,"Tlaxcala","29","San Francisco Tetlanohcan","050"]
[null,null,null,null,null,null,null,null,null,"Tlaxcala","29","San Jerónimo Zacualpan","051"]
[null,null,null,null,null,null,null,null,null,"Tlaxcala","29","San José Teacalco","052"]
[null,null,null,null,null,null,null,null,null,"Tlaxcala","29","San Juan Huactzinco","053"]
[null,null,null,null,null,null,null,null,null,"Tlaxcala","29","San Lorenzo Axocomanitla","054"]
[null,null,null,null,null,null,null,null,null,"Tlaxcala","29","San Lucas Tecopilco","055"]
[null,null,null,null,null,null,null,null,null,"Tlaxcala","29","Santa Ana Nopalucan","056"]
[null,null,null,null,null,null,null,null,null,"Tlaxcala","29","Santa Apolonia Teacalco","057"]
[null,null,null,null,null,null,null,null,null,"Tlaxcala","29","Santa Catarina Ayometla","058"]
[null,null,null,null,null,null,null,null,null,"Tlaxcala","29","Santa Cruz Quilehtla","059"]
[null,null,null,null,null,null,null,null,null,"Tlaxcala","29","Santa Isabel Xiloxoxtla","060"]
[null,null,null,null,null,null,null,null,null,"Veracruz de Ignacio de la Llave","30","Acajete","001"]
[null,null,null,null,null,null,null,null,null,"Veracruz de Ignacio de la Llave","30","Acatlán","002"]
[null,null,null,null,null,null,null,null,null,"Veracruz de Ignacio de la Llave","30","Acayucan","003"]
[null,null,null,null,null,null,null,null,null,"Veracruz de Ignacio de la Llave","30","Actopan","004"]
[null,null,null,null,null,null,null,null,null,"Veracruz de Ignacio de la Llave","30","Acula","005"]
[null,null,null,null,null,null,null,null,null,"Veracruz de Ignacio de la Llave","30","Acultzingo","006"]
[null,null,null,null,null,null,null,null,null,"Veracruz de Ignacio de la Llave","30","Camarón de Tejeda","007"]
[null,null,null,null,null,null,null,null,null,"Veracruz de Ignacio de la Llave","30","Alpatláhuac","008"]
[null,null,null,null,null,null,null,null,null,"Veracruz de Ignacio de la Llave","30","Alto Lucero de Gutiérrez Barrios","009"]
[null,null,null,null,null,null,null,null,null,"Veracruz de Ignacio de la Llave","30","Altotonga","010"]
[null,null,null,null,null,null,null,null,null,"Veracruz de Ignacio de la Llave","30","Alvarado","011"]
[null,null,null,null,null,null,null,null,null,"Veracruz de Ignacio de la Llave","30","Amatitlán","012"]
[null,null,null,null,null,null,null,null,null,"Veracruz de Ignacio de la Llave","30","Naranjos Amatlán","013"]
[null,null,null,null,null,null,null,null,null,"Veracruz de Ignacio de la Llave","30","Amatlán de los Reyes","014"]
[null,null,null,null,null,null,null,null,null,"Veracruz de Ignacio de la Llave","30","Angel R. Cabada","015"]
[null,null,null,null,null,null,null,null,null,"Veracruz de Ignacio de la Llave","30","La Antigua","016"]
[null,null,null,null,null,null,null,null,null,"Veracruz de Ignacio de la Llave","30","Apazapan","017"]
[null,null,null,null,null,null,null,null,null,"Veracruz de Ignacio de la Llave","30","Aquila","018"]
[null,null,null,null,null,null,null,null,null,"Veracruz de Ignacio de la Llave","30","Astacinga","019"]
[null,null,null,null,null,null,null,null,null,"Veracruz de Ignacio de la Llave","30","Atlahuilco","020"]
[null,null,null,null,null,null,null,null,null,"Veracruz de Ignacio de la Llave","30","Atoyac","021"]
[null,null,null,null,null,null,null,null,null,"Veracruz de Ignacio de la Llave","30","Atzacan","022"]
[null,null,null,null,null,null,null,null,null,"Veracruz de Ignacio de la Llave","30","Atzalan","023"]
[null,null,null,null,null,null,null,null,null,"Veracruz de Ignacio de la Llave","30","Tlaltetela","024"]
[null,null,null,null,null,null,null,null,null,"Veracruz de Ignacio de la Llave","30","Ayahualulco","025"]
[null,null,null,null,null,null,null,null,null,"Veracruz de Ignacio de la Llave","30","Banderilla","026"]
[null,null,null,null,null,null,null,null,null,"Veracruz de Ignacio de la Llave","30","Benito Juárez","027"]
[null,null,null,null,null,null,null,null,null,"Veracruz de Ignacio de la Llave","30","Boca del Río","028"]
[null,null,null,null,null,null,null,null,null,"Veracruz de Ignacio de la Llave","30","Calcahualco","029"]
[null,null,null,null,null,null,null,null,null,"Veracruz de Ignacio de la Llave","30","Camerino Z. Mendoza","030"]
[null,null,null,null,null,null,null,null,null,"Veracruz de Ignacio de la Llave","30","Carrillo Puerto","031"]
[null,null,null,null,null,null,null,null,null,"Veracruz de Ignacio de la Llave","30","Catemaco","032"]
[null,null,null,null,null,null,null,null,null,"Veracruz de Ignacio de la Llave","30","Cazones de Herrera","033"]
[null,null,null,null,null,null,null,null,null,"Veracruz de Ignacio de la Llave","30","Cerro Azul","034"]
[null,null,null,null,null,null,null,null,null,"Veracruz de Ignacio de la Llave","30","Citlaltépetl","035"]
[null,null,null,null,null,null,null,null,null,"Veracruz de Ignacio de la Llave","30","Coacoatzintla","036"]
[null,null,null,null,null,null,null,null,null,"Veracruz de Ignacio de la Llave","30","Coahuitlán","037"]
[null,null,null,null,null,null,null,null,null,"Veracruz de Ignacio de la Llave","30","Coatepec","038"]
[null,null,null,null,null,null,null,null,null,"Veracruz de Ignacio de la Llave","30","Coatzacoalcos","039"]
[null,null,null,null,null,null,null,null,null,"Veracruz de Ignacio de la Llave","30","Coatzintla","040"]
[null,null,null,null,null,null,null,null,null,"Veracruz de Ignacio de la Llave","30","Coetzala","041"]
[null,null,null,null,null,null,null,null,null,"Veracruz de Ignacio de la Llave","30","Colipa","042"]
[null,null,null,null,null,null,null,null,null,"Veracruz de Ignacio de la Llave","30","Comapa","043"]
[null,null,null,null,null,null,null,null,null,"Veracruz de Ignacio de la Llave","30","Córdoba","044"]
[null,null,null,null,null,null,null,null,null,"Veracruz de Ignacio de la Llave","30","Cosamaloapan de Carpio","045"]
[null,null,null,null,null,null,null,null,null,"Veracruz de Ignacio de la Llave","30","Cosautlán de Carvajal","046"]
[null,null,null,null,null,null,null,null,null,"Veracruz de Ignacio de la Llave","30","Coscomatepec","047"]
[null,null,null,null,null,null,null,null,null,"Veracruz de Ignacio de la Llave","30","Cosoleacaque","048"]
[null,null,null,null,null,null,null,null,null,"Veracruz de Ignacio de la Llave","30","Cotaxtla","049"]
[null,null,null,null,null,null,null,null,null,"Veracruz de Ignacio de la Llave","30","Coxquihui","050"]
[null,null,null,null,null,null,null,null,null,"Veracruz de Ignacio de la Llave","30","Coyutla","051"]
[null,null,null,null,null,null,null,null,null,"Veracruz de Ignacio de la Llave","30","Cuichapa","052"]
[null,null,null,null,null,null,null,null,null,"Veracruz de Ignacio de la Llave","30","Cuitláhuac","053"]
[null,null,null,null,null,null,null,null,null,"Veracruz de Ignacio de la Llave","30","Chacaltianguis","054"]
[null,null,null,null,null,null,null,null,null,"Veracruz de Ignacio de la Llave","30","Chalma","055"]
[null,null,null,null,null,null,null,null,null,"Veracruz de Ignacio de la Llave","30","Chiconamel","056"]
[null,null,null,null,null,null,null,null,null,"Veracruz de Ignacio de la Llave","30","Chiconquiaco","057"]
[null,null,null,null,null,null,null,null,null,"Veracruz de Ignacio de la Llave","30","Chicontepec","058"]
[null,null,null,null,null,null,null,null,null,"Veracruz de Ignacio de la Llave","30","Chinameca","059"]
[null,null,null,null,null,null,null,null,null,"Veracruz de Ignacio de la Llave","30","Chinampa de Gorostiza","060"]
[null,null,null,null,null,null,null,null,null,"Veracruz de Ignacio de la Llave","30","Las Choapas","061"]
[null,null,null,null,null,null,null,null,null,"Veracruz de Ignacio de la Llave","30","Chocamán","062"]
[null,null,null,null,null,null,null,null,null,"Veracruz de Ignacio de la Llave","30","Chontla","063"]
[null,null,null,null,null,null,null,null,null,"Veracruz de Ignacio de la Llave","30","Chumatlán","064"]
[null,null,null,null,null,null,null,null,null,"Veracruz de Ignacio de la Llave","30","Emiliano Zapata","065"]
[null,null,null,null,null,null,null,null,null,"Veracruz de Ignacio de la Llave","30","Espinal","066"]
[null,null,null,null,null,null,null,null,null,"Veracruz de Ignacio de la Llave","30","Filomeno Mata","067"]
[null,null,null,null,null,null,null,null,null,"Veracruz de Ignacio de la Llave","30","Fortín","068"]
[null,null,null,null,null,null,null,null,null,"Veracruz de Ignacio de la Llave","30","Gutiérrez Zamora","069"]
[null,null,null,null,null,null,null,null,null,"Veracruz de Ignacio de la Llave","30","Hidalgotitlán","070"]
[null,null,null,null,null,null,null,null,null,"Veracruz de Ignacio de la Llave","30","Huatusco","071"]
[null,null,null,null,null,null,null,null,null,"Veracruz de Ignacio de la Llave","30","Huayacocotla","072"]
[null,null,null,null,null,null,null,null,null,"Veracruz de Ignacio de la Llave","30","Hueyapan de Ocampo","073"]
[null,null,null,null,null,null,null,null,null,"Veracruz de Ignacio de la Llave","30","Huiloapan de Cuauhtémoc","074"]
[null,null,null,null,null,null,null,null,null,"Veracruz de Ignacio de la Llave","30","Ignacio de la Llave","075"]
[null,null,null,null,null,null,null,null,null,"Veracruz de Ignacio de la Llave","30","Ilamatlán","076"]
[null,null,null,null,null,null,null,null,null,"Veracruz de Ignacio de la Llave","30","Isla","077"]
[null,null,null,null,null,null,null,null,null,"Veracruz de Ignacio de la Llave","30","Ixcatepec","078"]
[null,null,null,null,null,null,null,null,null,"Veracruz de Ignacio de la Llave","30","Ixhuacán de los Reyes","079"]
[null,null,null,null,null,null,null,null,null,"Veracruz de Ignacio de la Llave","30","Ixhuatlán del Café","080"]
[null,null,null,null,null,null,null,null,null,"Veracruz de Ignacio de la Llave","30","Ixhuatlancillo","081"]
[null,null,null,null,null,null,null,null,null,"Veracruz de Ignacio de la Llave","30","Ixhuatlán del Sureste","082"]
[null,null,null,null,null,null,null,null,null,"Veracruz de Ignacio de la Llave","30","Ixhuatlán de Madero","083"]
[null,null,null,null,null,null,null,null,null,"Veracruz de Ignacio de la Llave","30","Ixmatlahuacan","084"]
[null,null,null,null,null,null,null,null,null,"Veracruz de Ignacio de la Llave","30","Ixtaczoquitlán","085"]
[null,null,null,null,null,null,null,null,null,"Veracruz de Ignacio de la Llave","30","Jalacingo","086"]
[null,null,null,null,null,null,null,null,null,"Veracruz de Ignacio de la Llave","30","Xalapa","087"]
[null,null,null,null,null,null,null,null,null,"Veracruz de Ignacio de la Llave","30","Jalcomulco","088"]
[null,null,null,null,null,null,null,null,null,"Veracruz de Ignacio de la Llave","30","Jáltipan","089"]
[null,null,null,null,null,null,null,null,null,"Veracruz de Ignacio de la Llave","30","Jamapa","090"]
[null,null,null,null,null,null,null,null,null,"Veracruz de Ignacio de la Llave","30","Jesús Carranza","091"]
[null,null,null,null,null,null,null,null,null,"Veracruz de Ignacio de la Llave","30","Xico","092"]
[null,null,null,null,null,null,null,null,null,"Veracruz de Ignacio de la Llave","30","Jilotepec","093"]
[null,null,null,null,null,null,null,null,null,"Veracruz de Ignacio de la Llave","30","Juan Rodríguez Clara","094"]
[null,null,null,null,null,null,null,null,null,"Veracruz de Ignacio de la Llave","30","Juchique de Ferrer","095"]
[null,null,null,null,null,null,null,null,null,"Veracruz de Ignacio de la Llave","30","Landero y Coss","096"]
[null,null,null,null,null,null,null,null,null,"Veracruz de Ignacio de la Llave","30","Lerdo de Tejada","097"]
[null,null,null,null,null,null,null,null,null,"Veracruz de Ignacio de la Llave","30","Magdalena","098"]
[null,null,null,null,null,null,null,null,null,"Veracruz de Ignacio de la Llave","30","Maltrata","099"]
[null,null,null,null,null,null,null,null,null,"Veracruz de Ignacio de la Llave","30","Manlio Fabio Altamirano","100"]
[null,null,null,null,null,null,null,null,null,"Veracruz de Ignacio de la Llave","30","Mariano Escobedo","101"]
[null,null,null,null,null,null,null,null,null,"Veracruz de Ignacio de la Llave","30","Martínez de la Torre","102"]
[null,null,null,null,null,null,null,null,null,"Veracruz de Ignacio de la Llave","30","Mecatlán","103"]
[null,null,null,null,null,null,null,null,null,"Veracruz de Ignacio de la Llave","30","Mecayapan","104"]
[null,null,null,null,null,null,null,null,null,"Veracruz de Ignacio de la Llave","30","Medellín de Bravo","105"]
[null,null,null,null,null,null,null,null,null,"Veracruz de Ignacio de la Llave","30","Miahuatlán","106"]
[null,null,null,null,null,null,null,null,null,"Veracruz de Ignacio de la Llave","30","Las Minas","107"]
[null,null,null,null,null,null,null,null,null,"Veracruz de Ignacio de la Llave","30","Minatitlán","108"]
[null,null,null,null,null,null,null,null,null,"Veracruz de Ignacio de la Llave","30","Misantla","109"]
[null,null,null,null,null,null,null,null,null,"Veracruz de Ignacio de la Llave","30","Mixtla de Altamirano","110"]
[null,null,null,null,null,null,null,null,null,"Veracruz de Ignacio de la Llave","30","Moloacán","111"]
[null,null,null,null,null,null,null,null,null,"Veracruz de Ignacio de la Llave","30","Naolinco","112"]
[null,null,null,null,null,null,null,null,null,"Veracruz de Ignacio de la Llave","30","Naranjal","113"]
[null,null,null,null,null,null,null,null,null,"Veracruz de Ignacio de la Llave","30","Nautla","114"]
[null,null,null,null,null,null,null,null,null,"Veracruz de Ignacio de la Llave","30","Nogales","115"]
[null,null,null,null,null,null,null,null,null,"Veracruz de Ignacio de la Llave","30","Oluta","116"]
[null,null,null,null,null,null,null,null,null,"Veracruz de Ignacio de la Llave","30","Omealca","117"]
[null,null,null,null,null,null,null,null,null,"Veracruz de Ignacio de la Llave","30","Orizaba","118"]
[null,null,null,null,null,null,null,null,null,"Veracruz de Ignacio de la Llave","30","Otatitlán","119"]
[null,null,null,null,null,null,null,null,null,"Veracruz de Ignacio de la Llave","30","Oteapan","120"]
[null,null,null,null,null,null,null,null,null,"Veracruz de Ignacio de la Llave","30","Ozuluama de Mascareñas","121"]
[null,null,null,null,null,null,null,null,null,"Veracruz de Ignacio de la Llave","30","Pajapan","122"]
[null,null,null,null,null,null,null,null,null,"Veracruz de Ignacio de la Llave","30","Pánuco","123"]
[null,null,null,null,null,null,null,null,null,"Veracruz de Ignacio de la Llave","30","Papantla","124"]
[null,null,null,null,null,null,null,null,null,"Veracruz de Ignacio de la Llave","30","Paso del Macho","125"]
[null,null,null,null,null,null,null,null,null,"Veracruz de Ignacio de la Llave","30","Paso de Ovejas","126"]
[null,null,null,null,null,null,null,null,null,"Veracruz de Ignacio de la Llave","30","La Perla","127"]
[null,null,null,null,null,null,null,null,null,"Veracruz de Ignacio de la Llave","30","Perote","128"]
[null,null,null,null,null,null,null,null,null,"Veracruz de Ignacio de la Llave","30","Platón Sánchez","129"]
[null,null,null,null,null,null,null,null,null,"Veracruz de Ignacio de la Llave","30","Playa Vicente","130"]
[null,null,null,null,null,null,null,null,null,"Veracruz de Ignacio de la Llave","30","Poza Rica de Hidalgo","131"]
[null,null,null,null,null,null,null,null,null,"Veracruz de Ignacio de la Llave","30","Las Vigas de Ramírez","132"]
[null,null,null,null,null,null,null,null,null,"Veracruz de Ignacio de la Llave","30","Pueblo Viejo","133"]
[null,null,null,null,null,null,null,null,null,"Veracruz de Ignacio de la Llave","30","Puente Nacional","134"]
[null,null,null,null,null,null,null,null,null,"Veracruz de Ignacio de la Llave","30","Rafael Delgado","135"]
[null,null,null,null,null,null,null,null,null,"Veracruz de Ignacio de la Llave","30","Rafael Lucio","136"]
[null,null,null,null,null,null,null,null,null,"Veracruz de Ignacio de la Llave","30","Los Reyes","137"]
[null,null,null,null,null,null,null,null,null,"Veracruz de Ignacio de la Llave","30","Río Blanco","138"]
[null,null,null,null,null,null,null,null,null,"Veracruz de Ignacio de la Llave","30","Saltabarranca","139"]
[null,null,null,null,null,null,null,null,null,"Veracruz de Ignacio de la Llave","30","San Andrés Tenejapan","140"]
[null,null,null,null,null,null,null,null,null,"Veracruz de Ignacio de la Llave","30","San Andrés Tuxtla","141"]
[null,null,null,null,null,null,null,null,null,"Veracruz de Ignacio de la Llave","30","San Juan Evangelista","142"]
[null,null,null,null,null,null,null,null,null,"Veracruz de Ignacio de la Llave","30","Santiago Tuxtla","143"]
[null,null,null,null,null,null,null,null,null,"Veracruz de Ignacio de la Llave","30","Sayula de Alemán","144"]
[null,null,null,null,null,null,null,null,null,"Veracruz de Ignacio de la Llave","30","Soconusco","145"]
[null,null,null,null,null,null,null,null,null,"Veracruz de Ignacio de la Llave","30","Sochiapa","146"]
[null,null,null,null,null,null,null,null,null,"Veracruz de Ignacio de la Llave","30","Soledad Atzompa","147"]
[null,null,null,null,null,null,null,null,null,"Veracruz de Ignacio de la Llave","30","Soledad de Doblado","148"]
[null,null,null,null,null,null,null,null,null,"Veracruz de Ignacio de la Llave","30","Soteapan","149"]
[null,null,null,null,null,null,null,null,null,"Veracruz de Ignacio de la Llave","30","Tamalín","150"]
[null,null,null,null,null,null,null,null,null,"Veracruz de Ignacio de la Llave","30","Tamiahua","151"]
[null,null,null,null,null,null,null,null,null,"Veracruz de Ignacio de la Llave","30","Tampico Alto","152"]
[null,null,null,null,null,null,null,null,null,"Veracruz de Ignacio de la Llave","30","Tancoco","153"]
[null,null,null,null,null,null,null,null,null,"Veracruz de Ignacio de la Llave","30","Tantima","154"]
[null,null,null,null,null,null,null,null,null,"Veracruz de Ignacio de la Llave","30","Tantoyuca","155"]
[null,null,null,null,null,null,null,null,null,"Veracruz de Ignacio de la Llave","30","Tatatila","156"]
[null,null,null,null,null,null,null,null,null,"Veracruz de Ignacio de la Llave","30","Castillo de Teayo","157"]
[null,null,null,null,null,null,null,null,null,"Veracruz de Ignacio de la Llave","30","Tecolutla","158"]
[null,null,null,null,null,null,null,null,null,"Veracruz de Ignacio de la Llave","30","Tehuipango","159"]
[null,null,null,null,null,null,null,null,null,"Veracruz de Ignacio de la Llave","30","Álamo Temapache","160"]
[null,null,null,null,null,null,null,null,null,"Veracruz de Ignacio de la Llave","30","Tempoal","161"]
[null,null,null,null,null,null,null,null,null,"Veracruz de Ignacio de la Llave","30","Tenampa","162"]
[null,null,null,null,null,null,null,null,null,"Veracruz de Ignacio de la Llave","30","Tenochtitlán","163"]
[null,null,null,null,null,null,null,null,null,"Veracruz de Ignacio de la Llave","30","Teocelo","164"]
[null,null,null,null,null,null,null,null,null,"Veracruz de Ignacio de la Llave","30","Tepatlaxco","165"]
[null,null,null,null,null,null,null,null,null,"Veracruz de Ignacio de la Llave","30","Tepetlán","166"]
[null,null,null,null,null,null,null,null,null,"Veracruz de Ignacio de la Llave","30","Tepetzintla","167"]
[null,null,null,null,null,null,null,null,null,"Veracruz de Ignacio de la Llave","30","Tequila","168"]
[null,null,null,null,null,null,null,null,null,"Veracruz de Ignacio de la Llave","30","José Azueta","169"]
[null,null,null,null,null,null,null,null,null,"Veracruz de Ignacio de la Llave","30","Texcatepec","170"]
[null,null,null,null,null,null,null,null,null,"Veracruz de Ignacio de la Llave","30","Texhuacán","171"]
[null,null,null,null,null,null,null,null,null,"Veracruz de Ignacio de la Llave","30","Texistepec","172"]
[null,null,null,null,null,null,null,null,null,"Veracruz de Ignacio de la Llave","30","Tezonapa","173"]
[null,null,null,null,null,null,null,null,null,"Veracruz de Ignacio de la Llave","30","Tierra Blanca","174"]
[null,null,null,null,null,null,null,null,null,"Veracruz de Ignacio de la Llave","30","Tihuatlán","175"]
[null,null,null,null,null,null,null,null,null,"Veracruz de Ignacio de la Llave","30","Tlacojalpan","176"]
[null,null,null,null,null,null,null,null,null,"Veracruz de Ignacio de la Llave","30","Tlacolulan","177"]
[null,null,null,null,null,null,null,null,null,"Veracruz de Ignacio de la Llave","30","Tlacotalpan","178"]
[null,null,null,null,null,null,null,null,null,"Veracruz de Ignacio de la Llave","30","Tlacotepec de Mejía","179"]
[null,null,null,null,null,null,null,null,null,"Veracruz de Ignacio de la Llave","30","Tlachichilco","180"]
[null,null,null,null,null,null,null,null,null,"Veracruz de Ignacio de la Llave","30","Tlalixcoyan","181"]
[null,null,null,null,null,null,null,null,null,"Veracruz de Ignacio de la Llave","30","Tlalnelhuayocan","182"]
[null,null,null,null,null,null,null,null,null,"Veracruz de Ignacio de la Llave","30","Tlapacoyan","183"]
[null,null,null,null,null,null,null,null,null,"Veracruz de Ignacio de la Llave","30","Tlaquilpa","184"]
[null,null,null,null,null,null,null,null,null,"Veracruz de Ignacio de la Llave","30","Tlilapan","185"]
[null,null,null,null,null,null,null,null,null,"Veracruz de Ignacio de la Llave","30","Tomatlán","186"]
[null,null,null,null,null,null,null,null,null,"Veracruz de Ignacio de la Llave","30","Tonayán","187"]
[null,null,null,null,null,null,null,null,null,"Veracruz de Ignacio de la Llave","30","Totutla","188"]
[null,null,null,null,null,null,null,null,null,"Veracruz de Ignacio de la Llave","30","Tuxpan","189"]
[null,null,null,null,null,null,null,null,null,"Veracruz de Ignacio de la Llave","30","Tuxtilla","190"]
[null,null,null,null,null,null,null,null,null,"Veracruz de Ignacio de la Llave","30","Ursulo Galván","191"]
[null,null,null,null,null,null,null,null,null,"Veracruz de Ignacio de la Llave","30","Vega de Alatorre","192"]
[null,null,null,null,null,null,null,null,null,"Veracruz de Ignacio de la Llave","30","Veracruz","193"]
[null,null,null,null,null,null,null,null,null,"Veracruz de Ignacio de la Llave","30","Villa Aldama","194"]
[null,null,null,null,null,null,null,null,null,"Veracruz de Ignacio de la Llave","30","Xoxocotla","195"]
[null,null,null,null,null,null,null,null,null,"Veracruz de Ignacio de la Llave","30","Yanga","196"]
[null,null,null,null,null,null,null,null,null,"Veracruz de Ignacio de la Llave","30","Yecuatla","197"]
[null,null,null,null,null,null,null,null,null,"Veracruz de Ignacio de la Llave","30","Zacualpan","198"]
[null,null,null,null,null,null,null,null,null,"Veracruz de Ignacio de la Llave","30","Zaragoza","199"]
[null,null,null,null,null,null,null,null,null,"Veracruz de Ignacio de la Llave","30","Zentla","200"]
[null,null,null,null,null,null,null,null,null,"Veracruz de Ignacio de la Llave","30","Zongolica","201"]
[null,null,null,null,null,null,null,null,null,"Veracruz de Ignacio de la Llave","30","Zontecomatlán de López y Fuentes","202"]
[null,null,null,null,null,null,null,null,null,"Veracruz de Ignacio de la Llave","30","Zozocolco de Hidalgo","203"]
[null,null,null,null,null,null,null,null,null,"Veracruz de Ignacio de la Llave","30","Agua Dulce","204"]
[null,null,null,null,null,null,null,null,null,"Veracruz de Ignacio de la Llave","30","El Higo","205"]
[null,null,null,null,null,null,null,null,null,"Veracruz de Ignacio de la Llave","30","Nanchital de Lázaro Cárdenas del Río","206"]
[null,null,null,null,null,null,null,null,null,"Veracruz de Ignacio de la Llave","30","Tres Valles","207"]
[null,null,null,null,null,null,null,null,null,"Veracruz de Ignacio de la Llave","30","Carlos A. Carrillo","208"]
[null,null,null,null,null,null,null,null,null,"Veracruz de Ignacio de la Llave","30","Tatahuicapan de Juárez","209"]
[null,null,null,null,null,null,null,null,null,"Veracruz de Ignacio de la Llave","30","Uxpanapa","210"]
[null,null,null,null,null,null,null,null,null,"Veracruz de Ignacio de la Llave","30","San Rafael","211"]
[null,null,null,null,null,null,null,null,null,"Veracruz de Ignacio de la Llave","30","Santiago Sochiapan","212"]
[null,null,null,null,null,null,null,null,null,"Yucatán","31","Abalá","001"]
[null,null,null,null,null,null,null,null,null,"Yucatán","31","Acanceh","002"]
[null,null,null,null,null,null,null,null,null,"Yucatán","31","Akil","003"]
[null,null,null,null,null,null,null,null,null,"Yucatán","31","Baca","004"]
[null,null,null,null,null,null,null,null,null,"Yucatán","31","Bokobá","005"]
[null,null,null,null,null,null,null,null,null,"Yucatán","31","Buctzotz","006"]
[null,null,null,null,null,null,null,null,null,"Yucatán","31","Cacalchén","007"]
[null,null,null,null,null,null,null,null,null,"Yucatán","31","Calotmul","008"]
[null,null,null,null,null,null,null,null,null,"Yucatán","31","Cansahcab","009"]
[null,null,null,null,null,null,null,null,null,"Yucatán","31","Cantamayec","010"]
[null,null,null,null,null,null,null,null,null,"Yucatán","31","Celestún","011"]
[null,null,null,null,null,null,null,null,null,"Yucatán","31","Cenotillo","012"]
[null,null,null,null,null,null,null,null,null,"Yucatán","31","Conkal","013"]
[null,null,null,null,null,null,null,null,null,"Yucatán","31","Cuncunul","014"]
[null,null,null,null,null,null,null,null,null,"Yucatán","31","Cuzamá","015"]
[null,null,null,null,null,null,null,null,null,"Yucatán","31","Chacsinkín","016"]
[null,null,null,null,null,null,null,null,null,"Yucatán","31","Chankom","017"]
[null,null,null,null,null,null,null,null,null,"Yucatán","31","Chapab","018"]
[null,null,null,null,null,null,null,null,null,"Yucatán","31","Chemax","019"]
[null,null,null,null,null,null,null,null,null,"Yucatán","31","Chicxulub Pueblo","020"]
[null,null,null,null,null,null,null,null,null,"Yucatán","31","Chichimilá","021"]
[null,null,null,null,null,null,null,null,null,"Yucatán","31","Chikindzonot","022"]
[null,null,null,null,null,null,null,null,null,"Yucatán","31","Chocholá","023"]
[null,null,null,null,null,null,null,null,null,"Yucatán","31","Chumayel","024"]
[null,null,null,null,null,null,null,null,null,"Yucatán","31","Dzan","025"]
[null,null,null,null,null,null,null,null,null,"Yucatán","31","Dzemul","026"]
[null,null,null,null,null,null,null,null,null,"Yucatán","31","Dzidzantún","027"]
[null,null,null,null,null,null,null,null,null,"Yucatán","31","Dzilam de Bravo","028"]
[null,null,null,null,null,null,null,null,null,"Yucatán","31","Dzilam González","029"]
[null,null,null,null,null,null,null,null,null,"Yucatán","31","Dzitás","030"]
[null,null,null,null,null,null,null,null,null,"Yucatán","31","Dzoncauich","031"]
[null,null,null,null,null,null,null,null,null,"Yucatán","31","Espita","032"]
[null,null,null,null,null,null,null,null,null,"Yucatán","31","Halachó","033"]
[null,null,null,null,null,null,null,null,null,"Yucatán","31","Hocabá","034"]
[null,null,null,null,null,null,null,null,null,"Yucatán","31","Hoctún","035"]
[null,null,null,null,null,null,null,null,null,"Yucatán","31","Homún","036"]
[null,null,null,null,null,null,null,null,null,"Yucatán","31","Huhí","037"]
[null,null,null,null,null,null,null,null,null,"Yucatán","31","Hunucmá","038"]
[null,null,null,null,null,null,null,null,null,"Yucatán","31","Ixil","039"]
[null,null,null,null,null,null,null,null,null,"Yucatán","31","Izamal","040"]
[null,null,null,null,null,null,null,null,null,"Yucatán","31","Kanasín","041"]
[null,null,null,null,null,null,null,null,null,"Yucatán","31","Kantunil","042"]
[null,null,null,null,null,null,null,null,null,"Yucatán","31","Kaua","043"]
[null,null,null,null,null,null,null,null,null,"Yucatán","31","Kinchil","044"]
[null,null,null,null,null,null,null,null,null,"Yucatán","31","Kopomá","045"]
[null,null,null,null,null,null,null,null,null,"Yucatán","31","Mama","046"]
[null,null,null,null,null,null,null,null,null,"Yucatán","31","Maní","047"]
[null,null,null,null,null,null,null,null,null,"Yucatán","31","Maxcanú","048"]
[null,null,null,null,null,null,null,null,null,"Yucatán","31","Mayapán","049"]
[null,null,null,null,null,null,null,null,null,"Yucatán","31","Mérida","050"]
[null,null,null,null,null,null,null,null,null,"Yucatán","31","Mocochá","051"]
[null,null,null,null,null,null,null,null,null,"Yucatán","31","Motul","052"]
[null,null,null,null,null,null,null,null,null,"Yucatán","31","Muna","053"]
[null,null,null,null,null,null,null,null,null,"Yucatán","31","Muxupip","054"]
[null,null,null,null,null,null,null,null,null,"Yucatán","31","Opichén","055"]
[null,null,null,null,null,null,null,null,null,"Yucatán","31","Oxkutzcab","056"]
[null,null,null,null,null,null,null,null,null,"Yucatán","31","Panabá","057"]
[null,null,null,null,null,null,null,null,null,"Yucatán","31","Peto","058"]
[null,null,null,null,null,null,null,null,null,"Yucatán","31","Progreso","059"]
[null,null,null,null,null,null,null,null,null,"Yucatán","31","Quintana Roo","060"]
[null,null,null,null,null,null,null,null,null,"Yucatán","31","Río Lagartos","061"]
[null,null,null,null,null,null,null,null,null,"Yucatán","31","Sacalum","062"]
[null,null,null,null,null,null,null,null,null,"Yucatán","31","Samahil","063"]
[null,null,null,null,null,null,null,null,null,"Yucatán","31","Sanahcat","064"]
[null,null,null,null,null,null,null,null,null,"Yucatán","31","San Felipe","065"]
[null,null,null,null,null,null,null,null,null,"Yucatán","31","Santa Elena","066"]
[null,null,null,null,null,null,null,null,null,"Yucatán","31","Seyé","067"]
[null,null,null,null,null,null,null,null,null,"Yucatán","31","Sinanché","068"]
[null,null,null,null,null,null,null,null,null,"Yucatán","31","Sotuta","069"]
[null,null,null,null,null,null,null,null,null,"Yucatán","31","Sucilá","070"]
[null,null,null,null,null,null,null,null,null,"Yucatán","31","Sudzal","071"]
[null,null,null,null,null,null,null,null,null,"Yucatán","31","Suma","072"]
[null,null,null,null,null,null,null,null,null,"Yucatán","31","Tahdziú","073"]
[null,null,null,null,null,null,null,null,null,"Yucatán","31","Tahmek","074"]
[null,null,null,null,null,null,null,null,null,"Yucatán","31","Teabo","075"]
[null,null,null,null,null,null,null,null,null,"Yucatán","31","Tecoh","076"]
[null,null,null,null,null,null,null,null,null,"Yucatán","31","Tekal de Venegas","077"]
[null,null,null,null,null,null,null,null,null,"Yucatán","31","Tekantó","078"]
[null,null,null,null,null,null,null,null,null,"Yucatán","31","Tekax","079"]
[null,null,null,null,null,null,null,null,null,"Yucatán","31","Tekit","080"]
[null,null,null,null,null,null,null,null,null,"Yucatán","31","Tekom","081"]
[null,null,null,null,null,null,null,null,null,"Yucatán","31","Telchac Pueblo","082"]
[null,null,null,null,null,null,null,null,null,"Yucatán","31","Telchac Puerto","083"]
[null,null,null,null,null,null,null,null,null,"Yucatán","31","Temax","084"]
[null,null,null,null,null,null,null,null,null,"Yucatán","31","Temozón","085"]
[null,null,null,null,null,null,null,null,null,"Yucatán","31","Tepakán","086"]
[null,null,null,null,null,null,null,null,null,"Yucatán","31","Tetiz","087"]
[null,null,null,null,null,null,null,null,null,"Yucatán","31","Teya","088"]
[null,null,null,null,null,null,null,null,null,"Yucatán","31","Ticul","089"]
[null,null,null,null,null,null,null,null,null,"Yucatán","31","Timucuy","090"]
[null,null,null,null,null,null,null,null,null,"Yucatán","31","Tinum","091"]
[null,null,null,null,null,null,null,null,null,"Yucatán","31","Tixcacalcupul","092"]
[null,null,null,null,null,null,null,null,null,"Yucatán","31","Tixkokob","093"]
[null,null,null,null,null,null,null,null,null,"Yucatán","31","Tixmehuac","094"]
[null,null,null,null,null,null,null,null,null,"Yucatán","31","Tixpéhual","095"]
[null,null,null,null,null,null,null,null,null,"Yucatán","31","Tizimín","096"]
[null,null,null,null,null,null,null,null,null,"Yucatán","31","Tunkás","097"]
[null,null,null,null,null,null,null,null,null,"Yucatán","31","Tzucacab","098"]
[null,null,null,null,null,null,null,null,null,"Yucatán","31","Uayma","099"]
[null,null,null,null,null,null,null,null,null,"Yucatán","31","Ucú","100"]
[null,null,null,null,null,null,null,null,null,"Yucatán","31","Umán","101"]
[null,null,null,null,null,null,null,null,null,"Yucatán","31","Valladolid","102"]
[null,null,null,null,null,null,null,null,null,"Yucatán","31","Xocchel","103"]
[null,null,null,null,null,null,null,null,null,"Yucatán","31","Yaxcabá","104"]
[null,null,null,null,null,null,null,null,null,"Yucatán","31","Yaxkukul","105"]
[null,null,null,null,null,null,null,null,null,"Yucatán","31","Yobaín","106"]
[null,null,null,null,null,null,null,null,null,"Zacatecas","32","Apozol","001"]
[null,null,null,null,null,null,null,null,null,"Zacatecas","32","Apulco","002"]
[null,null,null,null,null,null,null,null,null,"Zacatecas","32","Atolinga","003"]
[null,null,null,null,null,null,null,null,null,"Zacatecas","32","Benito Juárez","004"]
[null,null,null,null,null,null,null,null,null,"Zacatecas","32","Calera","005"]
[null,null,null,null,null,null,null,null,null,"Zacatecas","32","Cañitas de Felipe Pescador","006"]
[null,null,null,null,null,null,null,null,null,"Zacatecas","32","Concepción del Oro","007"]
[null,null,null,null,null,null,null,null,null,"Zacatecas","32","Cuauhtémoc","008"]
[null,null,null,null,null,null,null,null,null,"Zacatecas","32","Chalchihuites","009"]
[null,null,null,null,null,null,null,null,null,"Zacatecas","32","Fresnillo","010"]
[null,null,null,null,null,null,null,null,null,"Zacatecas","32","Trinidad García de la Cadena","011"]
[null,null,null,null,null,null,null,null,null,"Zacatecas","32","Genaro Codina","012"]
[null,null,null,null,null,null,null,null,null,"Zacatecas","32","General Enrique Estrada","013"]
[null,null,null,null,null,null,null,null,null,"Zacatecas","32","General Francisco R. Murguía","014"]
[null,null,null,null,null,null,null,null,null,"Zacatecas","32","El Plateado de Joaquín Amaro","015"]
[null,null,null,null,null,null,null,null,null,"Zacatecas","32","General Pánfilo Natera","016"]
[null,null,null,null,null,null,null,null,null,"Zacatecas","32","Guadalupe","017"]
[null,null,null,null,null,null,null,null,null,"Zacatecas","32","Huanusco","018"]
[null,null,null,null,null,null,null,null,null,"Zacatecas","32","Jalpa","019"]
[null,null,null,null,null,null,null,null,null,"Zacatecas","32","Jerez","020"]
[null,null,null,null,null,null,null,null,null,"Zacatecas","32","Jiménez del Teul","021"]
[null,null,null,null,null,null,null,null,null,"Zacatecas","32","Juan Aldama","022"]
[null,null,null,null,null,null,null,null,null,"Zacatecas","32","Juchipila","023"]
[null,null,null,null,null,null,null,null,null,"Zacatecas","32","Loreto","024"]
[null,null,null,null,null,null,null,null,null,"Zacatecas","32","Luis Moya","025"]
[null,null,null,null,null,null,null,null,null,"Zacatecas","32","Mazapil","026"]
[null,null,null,null,null,null,null,null,null,"Zacatecas","32","Melchor Ocampo","027"]
[null,null,null,null,null,null,null,null,null,"Zacatecas","32","Mezquital del Oro","028"]
[null,null,null,null,null,null,null,null,null,"Zacatecas","32","Miguel Auza","029"]
[null,null,null,null,null,null,null,null,null,"Zacatecas","32","Momax","030"]
[null,null,null,null,null,null,null,null,null,"Zacatecas","32","Monte Escobedo","031"]
[null,null,null,null,null,null,null,null,null,"Zacatecas","32","Morelos","032"]
[null,null,null,null,null,null,null,null,null,"Zacatecas","32","Moyahua de Estrada","033"]
[null,null,null,null,null,null,null,null,null,"Zacatecas","32","Nochistlán de Mejía","034"]
[null,null,null,null,null,null,null,null,null,"Zacatecas","32","Noria de Ángeles","035"]
[null,null,null,null,null,null,null,null,null,"Zacatecas","32","Ojocaliente","036"]
[null,null,null,null,null,null,null,null,null,"Zacatecas","32","Pánuco","037"]
[null,null,null,null,null,null,null,null,null,"Zacatecas","32","Pinos","038"]
[null,null,null,null,null,null,null,null,null,"Zacatecas","32","Río Grande","039"]
[null,null,null,null,null,null,null,null,null,"Zacatecas","32","Sain Alto","040"]
[null,null,null,null,null,null,null,null,null,"Zacatecas","32","El Salvador","041"]
[null,null,null,null,null,null,null,null,null,"Zacatecas","32","Sombrerete","042"]
[null,null,null,null,null,null,null,null,null,"Zacatecas","32","Susticacán","043"]
[null,null,null,null,null,null,null,null,null,"Zacatecas","32","Tabasco","044"]
[null,null,null,null,null,null,null,null,null,"Zacatecas","32","Tepechitlán","045"]
[null,null,null,null,null,null,null,null,null,"Zacatecas","32","Tepetongo","046"]
[null,null,null,null,null,null,null,null,null,"Zacatecas","32","Teúl de González Ortega","047"]
[null,null,null,null,null,null,null,null,null,"Zacatecas","32","Tlaltenango de Sánchez Román","048"]
[null,null,null,null,null,null,null,null,null,"Zacatecas","32","Valparaíso","049"]
[null,null,null,null,null,null,null,null,null,"Zacatecas","32","Vetagrande","050"]
[null,null,null,null,null,null,null,null,null,"Zacatecas","32","Villa de Cos","051"]
[null,null,null,null,null,null,null,null,null,"Zacatecas","32","Villa García","052"]
[null,null,null,null,null,null,null,null,null,"Zacatecas","32","Villa González Ortega","053"]
[null,null,null,null,null,null,null,null,null,"Zacatecas","32","Villa Hidalgo","054"]
[null,null,null,null,null,null,null,null,null,"Zacatecas","32","Villanueva","055"]
[null,null,null,null,null,null,null,null,null,"Zacatecas","32","Zacatecas","056"]
[null,null,null,null,null,null,null,null,null,"Zacatecas","32","Trancoso","057"]
[null,null,null,null,null,null,null,null,null,"Zacatecas","32","Santa María de la Paz","058"]

{"sheet":"comparar","index":6,"n_rows":936,"n_cols":37,"rows_kept":936,"cut":false,"hidden":true,"merged":[]}
["ID_ENTIDAD",30,"33_1_1","33_1_2","33_1_3","33_2_1","33_2_2","33_2_3","33_3_1","33_3_2","33_3_3",35,"35_1",36,"36_09",38,"38_1",39,"39_09",58,59,null,65,"79_1_1","79_1_2"]
["201",1,519266,100,100,0,-2,-2,23603,99,1,2,-2,-2,-2,1,100,628910,-2,1,99,null,1,1,44]
["202",1,3590826,100,0,"NS",-1,-1,"NS",-1,-1,2,-2,-2,-2,1,100,1672599,-2,1,100,null,1,1,40]
["203",2,492877,24,76,97892,10,90,1872,40,60,2,-2,-2,-2,1,22,110659,-2,2,-2,null,1,2,0]
["204",2,1329320,99,100,0,-2,-2,9921,99,100,2,-2,-2,-2,1,99,383480,-2,1,99,null,1,1,35]
["205",2,"82795387","73","26","64668122","78","22","18127265","56","44",2,-2,-2,-2,1,50,722139,-2,1,70,null,1,1,30]
["206",1,"763841","92","8","5498","60","66","7184","100","0",1,100,128728,-2,1,100,381226,-2,1,79,null,1,1,62]
["207",2,"906101","100","100","906101","0","100","NS",-1,-1,1,100,2096653,-2,1,100,2096653,-2,2,-2,null,1,2,-2]
["208",2,"5978150","100","58","3322724","70","100","46396","70","100",2,-2,-2,-2,1,64,1456552,-2,1,70,null,1,2,-2]
["209",1,"47053","100","0","1881","99","1","10818","62","38",2,-2,-2,-2,1,100,1078982,-2,1,100,null,1,2,-2]
["210",2,434338,82,100,1058,67,100,710,100,100,2,-2,-2,-2,1,82,434338,-2,1,65,null,1,1,35]
["211",1,5826382,41,59,2230927,100,0,137371,4,96,2,-2,-2,-2,1,100,2470487,-2,1,41,null,1,2,-2]
["212",2,703546,0,100,"NS",-1,-1,864,100,100,1,100,689848,-2,1,100,689848,-2,2,-2,null,1,2,-2]
["213",2,"NS",-1,-1,"NS",-1,-1,"NS",-1,-1,2,-2,-2,-2,1,60,451322,-2,1,63,null,1,1,5]
["214",2,4199567,100,100,"NS",-1,-1,142037,100,100,1,93,3614585,-2,1,100,3718171,-2,1,40,null,1,2,-2]
["215",1,3224045,100,0,547802,1,100,9516,100,0,2,-2,-2,-2,1,100,2858496,-2,1,100,null,1,1,28]
["216",2,67141,0,100,67141,0,100,2634,0,100,2,-2,-2,-2,2,-2,-2,-2,1,-2,null,1,2,-2]
["217",2,81012,95,100,173205,100,100,4535,90,100,2,-2,-2,-2,1,100,710162,-2,1,95,null,1,1,64]
["218",2,"NS",-1,-1,"NS",-1,-1,19769,6,96,2,-2,-2,-2,2,-2,-2,-2,1,6,null,1,2,-2]
["219",1,8626886,85,100,10237,85,100,253474,85,100,2,-2,-2,-2,2,-2,-2,-2,1,85,null,1,2,-2]
["220",2,1400000,36,77,28950,36,77,9475,36,77,2,-2,-2,-2,1,64,14151,-2,1,43,null,1,2,-2]
["221",2,3172039,40,60,146564,39,61,8496,40,60,1,59,1799988,-2,1,41,1191394,-2,1,58,null,1,1,11]
["222",2,168443,100,0,1154,100,0,1835,0,100,2,-2,-2,-2,1,100,1005994,-2,1,90,null,1,1,80]
["223",2,112337,100,0,180,100,100,1397,90,100,2,-2,-2,-2,1,100,141173,-2,2,100,null,1,2,-2]
["224",1,1280000,100,100,0,-2,-2,32000,100,100,2,-2,-2,-2,1,100,479925,-2,1,100,null,1,1,5]
["225",2,3725401,60,100,74509,60,100,18698,60,100,1,49,546382,-2,1,49,546480,-2,1,90,null,1,1,30]
["226",1,1736556,26,100,108384,33,100,10216,21,100,2,-2,-2,-2,1,26,294536,-2,1,40,null,1,2,-2]
["227",1,2245044,93,89,354386,72,80,24910,94,100,2,-2,-2,-2,1,100,825140,-2,1,71,null,1,2,-2]
["128",1,3097804,90,100,60000,29,100,7894,96,100,2,-2,-2,-2,1,100,1006210,-2,1,45,null,1,2,-2]
["229",2,260732,100,100,20325,100,100,20325,100,100,2,-2,-2,-2,1,100,36899,-2,1,100,null,1,2,-2]
["230",2,253228,80,20,0,-2,-2,4161,0,100,2,-2,-2,-2,2,-2,-2,-2,1,100,null,1,2,-2]
["231",1,198348,100,0,109113,100,100,9473,100,100,2,-2,-2,-2,1,100,1196039,-2,1,100,null,1,1,92]
["232",2,"NS",-1,-1,39282,40,60,21010,40,60,2,-2,-2,-2,1,5,484,-2,1,-2,null,1,2,-2]
[]
[]
[]
[]
[]
[]
[]
[]
[]
[]
[]
[]
[]
[]
[]
[]
[]
[]
[]
[]
[]
[]
[]
[]
[]
[]
[]
[]
[]
[]
[]
[]
[]
[]
[]
[]
[]
[]
[]
[]
[]
[]
[]
[]
[]
[]
[]
[]
[]
[]
[]
[]
[]
[]
[]
[]
[]
[]
[]
[]
[]
[]
[]
[]
[]
[]
[]
[]
[]
[]
[]
[]
[]
[]
[]
[]
[]
[]
[]
[]
[]
[]
[]
[]
[]
[]
[]
[]
[]
[]
[]
[]
[]
[]
[]
[]
[]
[]
[]
[]
[]
[]
[]
[]
[]
[]
[]
[]
[]
[]
[]
[]
[]
[]
[]
[]
[]
[]
[]
[]
[]
[]
[]
[]
[]
[]
[]
[]
[]
[]
[]
[]
[]
[]
[]
[]
[]
[]
[]
[]
[]
[]
[]
[]
[]
[]
[]
[]
[]
[]
[]
[]
[]
[]
[]
[]
[]
[]
[]
[]
[]
[]
[]
[]
[]
[]
[]
[]
[]
[]
[]
[]
[]
[]
[]
[]
[]
[]
[]
[]
[]
[]
[]
[]
[]
[]
[]
[]
[]
[]
[]
[]
[]
[]
[]
[]
[]
[]
[]
[]
[]
[]
[]
[]
[]
[]
[]
[]
[]
[]
[]
[]
[]
[]
[]
[]
[]
[]
[]
[]
[]
[]
[]
[]
[]
[]
[]
[]
[]
[]
[]
[]
[]
[]
[]
[]
[]
[]
[]
[]
[]
[]
[]
[]
[]
[]
[]
[]
[]
[]
[]
[]
[]
[]
[]
[]
[]
[]
[]
[]
[]
[]
[]
[]
[]
[]
[]
[]
[]
[]
[]
[]
[]
[]
[]
[]
[]
[]
[]
[]
[]
[]
[]
[]
[]
[]
[]
[]
[]
[]
[]
[]
[]
[]
[]
[]
[]
[]
[]
[]
[]
[]
[]
[]
[]
[]
[]
[]
[]
[]
[]
[]
[]
[]
[]
[]
[]
[]
[]
[]
[]
[]
[]
[]
[]
[]
[]
[]
[]
[]
[]
[]
[]
[]
[]
[]
[]
[]
[]
[]
[]
[]
[]
[]
[]
[]
[]
[]
[]
[]
[]
[]
[]
[]
[]
[]
[]
[]
[]
[]
[]
[]
[]
[]
[]
[]
[]
[]
[]
[]
[]
[]
[]
[]
[]
[]
[]
[]
[]
[]
[]
[]
[]
[]
[]
[]
[]
[]
[]
[]
[]
[]
[]
[]
[]
[]
[]
[]
[]
[]
[]
[]
[]
[]
[]
[]
[]
[]
[]
[]
[]
[]
[]
[]
[]
[]
[]
[]
[]
[]
[]
[]
[]
[]
[]
[]
[]
[]
[]
[]
[]
[]
[]
[]
[]
[]
[]
[]
[]
[]
[]
[]
[]
[]
[]
[]
[]
[]
[]
[]
[]
[]
[]
[]
[]
[]
[]
[]
[]
[]
[]
[]
[]
[]
[]
[]
[]
[]
[]
[]
[]
[]
[]
[]
[]
[]
[]
[]
[]
[]
[]
[]
[]
[]
[]
[]
[]
[]
[]
[]
[]
[]
[]
[]
[]
[]
[]
[]
[]
[]
[]
[]
[]
[]
[]
[]
[]
[]
[]
[]
[]
[]
[]
[]
[]
[]
[]
[]
[]
[]
[]
[]
[]
[]
[]
[]
[]
[]
[]
[]
[]
[]
[]
[]
[]
[]
[]
[]
[]
[]
[]
[]
[]
[]
[]
[]
[]
[]
[]
[]
[]
[]
[]
[]
[]
[]
[]
[]
[]
[]
[]
[]
[]
[]
[]
[]
[]
[]
[]
[]
[]
[]
[]
[]
[]
[]
[]
[]
[]
[]
[]
[]
[]
[]
[]
[]
[]
[]
[]
[]
[]
[]
[]
[]
[]
[]
[]
[]
[]
[]
[]
[]
[]
[]
[]
[]
[]
[]
[]
[]
[]
[]
[]
[]
[]
[]
[]
[]
[]
[]
[]
[]
[]
[]
[]
[]
[]
[]
[]
[]
[]
[]
[]
[]
[]
[]
[]
[]
[]
[]
[]
[]
[]
[]
[]
[]
[]
[]
[]
[]
[]
[]
[]
[]
[]
[]
[]
[]
[]
[]
[]
[]
[]
[]
[]
[]
[]
[]
[]
[]
[]
[]
[]
[]
[]
[]
[]
[]
[]
[]
[]
[]
[]
[]
[]
[]
[]
[]
[]
[]
[]
[]
[]
[]
[]
[]
[]
[]
[]
[]
[]
[]
[]
[]
[]
[]
[]
[]
[]
[]
[]
[]
[]
[]
[]
[]
[]
[]
[]
[]
[]
[]
[]
[]
[]
[]
[]
[]
[]
[]
[]
[]
[]
[]
[]
[]
[]
[]
[]
[]
[]
[]
[]
[]
[]
[]
[]
[]
[]
[]
[]
[]
[]
[]
[]
[]
[]
[]
[]
[]
[]
[]
[]
[]
[]
[]
[]
[]
[]
[]
[]
[]
[]
[]
[]
[]
[]
[]
[]
[]
[]
[]
[]
[]
[]
[]
[]
[]
[]
[]
[]
[]
[]
[]
[]
[]
[]
[]
[]
[]
[]
[]
[]
[]
[]
[]
[]
[]
[]
[]
[]
[]
[]
[]
[]
[]
[]
[]
[]
[]
[]
[]
[]
[]
[]
[]
[]
[]
[]
[]
[]
[]
[]
[]
[]
[]
[]
[]
[]
[]
[]
[]
[]
[]
[]
[]
[]
[]
[]
[]
[]
[]
[]
[]
[]
[]
[]
[]
[]
[]
[]
[]
[]
[]
[]
[]
[]
[]
[]
[]
[]
[]
[]
[]
[]
[]
[]
[]
[]
[]
[]
[]
[]
[]
[]
[]
[]
[]
[]
[]
[]
[]
[]
[]
[]
[]
[]
[]
[]
[]
[]
[]
[null,null,null,null,null,null,null,null,null,null,null,null,null,null,null,null,null,null,null,null,null,null,null,null,null,null,null,null,null,null,null,null,null,null,null,null,0]

{"sheet":"Complemento 1","index":7,"n_rows":290,"n_cols":27,"rows_kept":290,"cut":false,"hidden":true,"merged":[[0,1,0,29],[2,1,2,29],[4,1,4,29],[6,1,6,29],[9,1,9,11],[9,13,9,14],[15,11,15,15],[15,17,15,22],[15,23,15,24],[15,25,15,29],[16,3,16,8],[16,9,16,10],[16,11,16,15],[16,17,16,22],[16,23,16,24],[16,25,16,29],[8,26,8,29],[11,2,11,29],[13,2,13,29],[14,3,14,8],[14,9,14,10],[14,11,14,15],[14,17,14,22],[14,23,14,24],[14,25,14,29],[15,3,15,8],[15,9,15,10],[19,3,19,8],[19,9,19,10],[19,11,19,15],[19,17,19,22],[19,23,19,24],[19,25,19,29],[18,3,18,8],[18,9,18,10],[18,11,18,15],[18,17,18,22],[18,23,18,24],[18,25,18,29],[17,3,17,8],[17,9,17,10],[17,11,17,15],[17,17,17,22],[17,23,17,24],[17,25,17,29],[22,3,22,8],[22,9,22,10],[22,11,22,15],[22,17,22,22],[22,23,22,24],[22,25,22,29],[21,3,21,8],[21,9,21,10],[21,11,21,15],[21,17,21,22],[21,23,21,24],[21,25,21,29],[20,3,20,8],[20,9,20,10],[20,11,20,15],[20,17,20,22],[20,23,20,24],[20,25,20,29],[25,3,25,8],[25,9,25,10],[25,11,25,15],[25,17,25,22],[25,23,25,24],[25,25,25,29],[24,3,24,8],[24,9,24,10],[24,11,24,15],[24,17,24,22],[24,23,24,24],[24,25,24,29],[23,3,23,8],[23,9,23,10],[23,11,23,15],[23,17,23,22],[23,23,23,24],[23,25,23,29],[28,3,28,8],[28,9,28,10],[28,11,28,15],[28,17,28,22],[28,23,28,24],[28,25,28,29],[27,3,27,8],[27,9,27,10],[27,11,27,15],[27,17,27,22],[27,23,27,24],[27,25,27,29],[26,3,26,8],[26,9,26,10],[26,11,26,15],[26,17,26,22],[26,23,26,24],[26,25,26,29],[31,3,31,8],[31,9,31,10],[31,11,31,15],[31,17,31,22],[31,23,31,24],[31,25,31,29],[30,3,30,8],[30,9,30,10],[30,11,30,15],[30,17,30,22],[30,23,30,24],[30,25,30,29],[29,3,29,8],[29,9,29,10],[29,11,29,15],[29,17,29,22],[29,23,29,24],[29,25,29,29],[34,3,34,8],[34,9,34,10],[34,11,34,15],[34,17,34,22],[34,23,34,24],[34,25,34,29],[33,3,33,8],[33,9,33,10],[33,11,33,15],[33,17,33,22],[33,23,33,24],[33,25,33,29],[32,3,32,8],[32,9,32,10],[32,11,32,15],[32,17,32,22],[32,23,32,24],[32,25,32,29],[37,3,37,8],[37,9,37,10],[37,11,37,15],[37,17,37,22],[37,23,37,24],[37,25,37,29],[36,3,36,8],[36,9,36,10],[36,11,36,15],[36,17,36,22],[36,23,36,24],[36,25,36,29],[35,3,35,8],[35,9,35,10],[35,11,35,15],[35,17,35,22],[35,23,35,24],[35,25,35,29],[40,3,40,8],[40,9,40,10],[40,11,40,15],[40,17,40,22],[40,23,40,24],[40,25,40,29],[39,3,39,8],[39,9,39,10],[39,11,39,15],[39,17,39,22],[39,23,39,24],[39,25,39,29],[38,3,38,8],[38,9,38,10],[38,11,38,15],[38,17,38,22],[38,23,38,24],[38,25,38,29],[43,3,43,8],[43,9,43,10],[43,11,43,15],[43,17,43,22],[43,23,43,24],[43,25,43,29],[42,3,42,8],[42,9,42,10],[42,11,42,15],[42,17,42,22],[42,23,42,24],[42,25,42,29],[41,3,41,8],[41,9,41,10],[41,11,41,15],[41,17,41,22],[41,23,41,24],[41,25,41,29],[46,3,46,8],[46,9,46,10],[46,11,46,15],[46,17,46,22],[46,23,46,24],[46,25,46,29],[45,3,45,8],[45,9,45,10],[45,11,45,15],[45,17,45,22],[45,23,45,24],[45,25,45,29],[44,3,44,8],[44,9,44,10],[44,11,44,15],[44,17,44,22],[44,23,44,24],[44,25,44,29],[49,3,49,8],[49,9,49,10],[49,11,49,15],[49,17,49,22],[49,23,49,24],[49,25,49,29],[48,3,48,8],[48,9,48,10],[48,11,48,15],[48,17,48,22],[48,23,48,24],[48,25,48,29],[47,3,47,8],[47,9,47,10],[47,11,47,15],[47,17,47,22],[47,23,47,24],[47,25,47,29],[52,3,52,8],[52,9,52,10],[52,11,52,15],[52,17,52,22],[52,23,52,24],[52,25,52,29],[51,3,51,8],[51,9,51,10],[51,11,51,15],[51,17,51,22],[51,23,51,24],[51,25,51,29],[50,3,50,8],[50,9,50,10],[50,11,50,15],[50,17,50,22],[50,23,50,24],[50,25,50,29],[55,3,55,8],[55,9,55,10],[55,11,55,15],[55,17,55,22],[55,23,55,24],[55,25,55,29],[54,3,54,8],[54,9,54,10],[54,11,54,15],[54,17,54,22],[54,23,54,24],[54,25,54,29],[53,3,53,8],[53,9,53,10],[53,11,53,15],[53,17,53,22],[53,23,53,24],[53,25,53,29],[58,3,58,8],[58,9,58,10],[58,11,58,15],[58,17,58,22],[58,23,58,24],[58,25,58,29],[57,3,57,8],[57,9,57,10],[57,11,57,15],[57,17,57,22],[57,23,57,24],[57,25,57,29],[56,3,56,8],[56,9,56,10],[56,11,56,15],[56,17,56,22],[56,23,56,24],[56,25,56,29],[61,3,61,8],[61,9,61,10],[61,11,61,15],[61,17,61,22],[61,23,61,24],[61,25,61,29],[60,3,60,8],[60,9,60,10],[60,11,60,15],[60,17,60,22],[60,23,60,24],[60,25,60,29],[59,3,59,8],[59,9,59,10],[59,11,59,15],[59,17,59,22],[59,23,59,24],[59,25,59,29],[64,3,64,8],[64,9,64,10],[64,11,64,15],[64,17,64,22],[64,23,64,24],[64,25,64,29],[63,3,63,8],[63,9,63,10],[63,11,63,15],[63,17,63,22],[63,23,63,24],[63,25,63,29],[62,3,62,8],[62,9,62,10],[62,11,62,15],[62,17,62,22],[62,23,62,24],[62,25,62,29],[67,3,67,8],[67,9,67,10],[67,11,67,15],[67,17,67,22],[67,23,67,24],[67,25,67,29],[66,3,66,8],[66,9,66,10],[66,11,66,15],[66,17,66,22],[66,23,66,24],[66,25,66,29],[65,3,65,8],[65,9,65,10],[65,11,65,15],[65,17,65,22],[65,23,65,24],[65,25,65,29],[70,3,70,8],[70,9,70,10],[70,11,70,15],[70,17,70,22],[70,23,70,24],[70,25,70,29],[69,3,69,8],[69,9,69,10],[69,11,69,15],[69,17,69,22],[69,23,69,24],[69,25,69,29],[68,3,68,8],[68,9,68,10],[68,11,68,15],[68,17,68,22],[68,23,68,24],[68,25,68,29],[73,3,73,8],[73,9,73,10],[73,11,73,15],[73,17,73,22],[73,23,73,24],[73,25,73,29],[72,3,72,8],[72,9,72,10],[72,11,72,15],[72,17,72,22],[72,23,72,24],[72,25,72,29],[71,3,71,8],[71,9,71,10],[71,11,71,15],[71,17,71,22],[71,23,71,24],[71,25,71,29],[76,3,76,8],[76,9,76,10],[76,11,76,15],[76,17,76,22],[76,23,76,24],[76,25,76,29],[75,3,75,8],[75,9,75,10],[75,11,75,15],[75,17,75,22],[75,23,75,24],[75,25,75,29],[74,3,74,8],[74,9,74,10],[74,11,74,15],[74,17,74,22],[74,23,74,24],[74,25,74,29],[79,3,79,8],[79,9,79,10],[79,11,79,15],[79,17,79,22],[79,23,79,24],[79,25,79,29],[78,3,78,8],[78,9,78,10],[78,11,78,15],[78,17,78,22],[78,23,78,24],[78,25,78,29],[77,3,77,8],[77,9,77,10],[77,11,77,15],[77,17,77,22],[77,23,77,24],[77,25,77,29],[82,3,82,8],[82,9,82,10],[82,11,82,15],[82,17,82,22],[82,23,82,24],[82,25,82,29],[81,3,81,8],[81,9,81,10],[81,11,81,15],[81,17,81,22],[81,23,81,24],[81,25,81,29],[80,3,80,8],[80,9,80,10],[80,11,80,15],[80,17,80,22],[80,23,80,24],[80,25,80,29],[85,3,85,8],[85,9,85,10],[85,11,85,15],[85,17,85,22],[85,23,85,24],[85,25,85,29],[84,3,84,8],[84,9,84,10],[84,11,84,15],[84,17,84,22],[84,23,84,24],[84,25,84,29],[83,3,83,8],[83,9,83,10],[83,11,83,15],[83,17,83,22],[83,23,83,24],[83,25,83,29],[88,3,88,8],[88,9,88,10],[88,11,88,15],[88,17,88,22],[88,23,88,24],[88,25,88,29],[87,3,87,8],[87,9,87,10],[87,11,87,15],[87,17,87,22],[87,23,87,24],[87,25,87,29],[86,3,86,8],[86,9,86,10],[86,11,86,15],[86,17,86,22],[86,23,86,24],[86,25,86,29],[91,3,91,8],[91,9,91,10],[91,11,91,15],[91,17,91,22],[91,23,91,24],[91,25,91,29],[90,3,90,8],[90,9,90,10],[90,11,90,15],[90,17,90,22],[90,23,90,24],[90,25,90,29],[89,3,89,8],[89,9,89,10],[89,11,89,15],[89,17,89,22],[89,23,89,24],[89,25,89,29],[94,3,94,8],[94,9,94,10],[94,11,94,15],[94,17,94,22],[94,23,94,24],[94,25,94,29],[93,3,93,8],[93,9,93,10],[93,11,93,15],[93,17,93,22],[93,23,93,24],[93,25,93,29],[92,3,92,8],[92,9,92,10],[92,11,92,15],[92,17,92,22],[92,23,92,24],[92,25,92,29],[97,3,97,8],[97,9,97,10],[97,11,97,15],[97,17,97,22],[97,23,97,24],[97,25,97,29],[96,3,96,8],[96,9,96,10],[96,11,96,15],[96,17,96,22],[96,23,96,24],[96,25,96,29],[95,3,95,8],[95,9,95,10],[95,11,95,15],[95,17,95,22],[95,23,95,24],[95,25,95,29],[100,3,100,8],[100,9,100,10],[100,11,100,15],[100,17,100,22],[100,23,100,24],[100,25,100,29],[99,3,99,8],[99,9,99,10],[99,11,99,15],[99,17,99,22],[99,23,99,24],[99,25,99,29],[98,3,98,8],[98,9,98,10],[98,11,98,15],[98,17,98,22],[98,23,98,24],[98,25,98,29],[103,3,103,8],[103,9,103,10],[103,11,103,15],[103,17,103,22],[103,23,103,24],[103,25,103,29],[102,3,102,8],[102,9,102,10],[102,11,102,15],[102,17,102,22],[102,23,102,24],[102,25,102,29],[101,3,101,8],[101,9,101,10],[101,11,101,15],[101,17,101,22],[101,23,101,24],[101,25,101,29],[106,3,106,8],[106,9,106,10],[106,11,106,15],[106,17,106,22],[106,23,106,24],[106,25,106,29],[105,3,105,8],[105,9,105,10],[105,11,105,15],[105,17,105,22],[105,23,105,24],[105,25,105,29],[104,3,104,8],[104,9,104,10],[104,11,104,15],[104,17,104,22],[104,23,104,24],[104,25,104,29],[109,3,109,8],[109,9,109,10],[109,11,109,15],[109,17,109,22],[109,23,109,24],[109,25,109,29],[108,3,108,8],[108,9,108,10],[108,11,108,15],[108,17,108,22],[108,23,108,24],[108,25,108,29],[107,3,107,8],[107,9,107,10],[107,11,107,15],[107,17,107,22],[107,23,107,24],[107,25,107,29],[112,3,112,8],[112,9,112,10],[112,11,112,15],[112,17,112,22],[112,23,112,24],[112,25,112,29],[111,3,111,8],[111,9,111,10],[111,11,111,15],[111,17,111,22],[111,23,111,24],[111,25,111,29],[110,3,110,8],[110,9,110,10],[110,11,110,15],[110,17,110,22],[110,23,110,24],[110,25,110,29],[115,3,115,8],[115,9,115,10],[115,11,115,15],[115,17,115,22],[115,23,115,24],[115,25,115,29],[114,3,114,8],[114,9,114,10],[114,11,114,15],[114,17,114,22],[114,23,114,24],[114,25,114,29],[113,3,113,8],[113,9,113,10],[113,11,113,15],[113,17,113,22],[113,23,113,24],[113,25,113,29],[118,3,118,8],[118,9,118,10],[118,11,118,15],[118,17,118,22],[118,23,118,24],[118,25,118,29],[117,3,117,8],[117,9,117,10],[117,11,117,15],[117,17,117,22],[117,23,117,24],[117,25,117,29],[116,3,116,8],[116,9,116,10],[116,11,116,15],[116,17,116,22],[116,23,116,24],[116,25,116,29],[121,3,121,8],[121,9,121,10],[121,11,121,15],[121,17,121,22],[121,23,121,24],[121,25,121,29],[120,3,120,8],[120,9,120,10],[120,11,120,15],[120,17,120,22],[120,23,120,24],[120,25,120,29],[119,3,119,8],[119,9,119,10],[119,11,119,15],[119,17,119,22],[119,23,119,24],[119,25,119,29],[124,3,124,8],[124,9,124,10],[124,11,124,15],[124,17,124,22],[124,23,124,24],[124,25,124,29],[123,3,123,8],[123,9,123,10],[123,11,123,15],[123,17,123,22],[123,23,123,24],[123,25,123,29],[122,3,122,8],[122,9,122,10],[122,11,122,15],[122,17,122,22],[122,23,122,24],[122,25,122,29],[127,3,127,8],[127,9,127,10],[127,11,127,15],[127,17,127,22],[127,23,127,24],[127,25,127,29],[126,3,126,8],[126,9,126,10],[126,11,126,15],[126,17,126,22],[126,23,126,24],[126,25,126,29],[125,3,125,8],[125,9,125,10],[125,11,125,15],[125,17,125,22],[125,23,125,24],[125,25,125,29],[130,3,130,8],[130,9,130,10],[130,11,130,15],[130,17,130,22],[130,23,130,24],[130,25,130,29],[129,3,129,8],[129,9,129,10],[129,11,129,15],[129,17,129,22],[129,23,129,24],[129,25,129,29],[128,3,128,8],[128,9,128,10],[128,11,128,15],[128,17,128,22],[128,23,128,24],[128,25,128,29],[133,3,133,8],[133,9,133,10],[133,11,133,15],[133,17,133,22],[133,23,133,24],[133,25,133,29],[132,3,132,8],[132,9,132,10],[132,11,132,15],[132,17,132,22],[132,23,132,24],[132,25,132,29],[131,3,131,8],[131,9,131,10],[131,11,131,15],[131,17,131,22],[131,23,131,24],[131,25,131,29],[136,3,136,8],[136,9,136,10],[136,11,136,15],[136,17,136,22],[136,23,136,24],[136,25,136,29],[135,3,135,8],[135,9,135,10],[135,11,135,15],[135,17,135,22],[135,23,135,24],[135,25,135,29],[134,3,134,8],[134,9,134,10],[134,11,134,15],[134,17,134,22],[134,23,134,24],[134,25,134,29],[139,3,139,8],[139,9,139,10],[139,11,139,15],[139,17,139,22],[139,23,139,24],[139,25,139,29],[138,3,138,8],[138,9,138,10],[138,11,138,15],[138,17,138,22],[138,23,138,24],[138,25,138,29],[137,3,137,8],[137,9,137,10],[137,11,137,15],[137,17,137,22],[137,23,137,24],[137,25,137,29],[142,3,142,8],[142,9,142,10],[142,11,142,15],[142,17,142,22],[142,23,142,24],[142,25,142,29],[141,3,141,8],[141,9,141,10],[141,11,141,15],[141,17,141,22],[141,23,141,24],[141,25,141,29],[140,3,140,8],[140,9,140,10],[140,11,140,15],[140,17,140,22],[140,23,140,24],[140,25,140,29],[145,3,145,8],[145,9,145,10],[145,11,145,15],[145,17,145,22],[145,23,145,24],[145,25,145,29],[144,3,144,8],[144,9,144,10],[144,11,144,15],[144,17,144,22],[144,23,144,24],[144,25,144,29],[143,3,143,8],[143,9,143,10],[143,11,143,15],[143,17,143,22],[143,23,143,24],[143,25,143,29],[148,3,148,8],[148,9,148,10],[148,11,148,15],[148,17,148,22],[148,23,148,24],[148,25,148,29],[147,3,147,8],[147,9,147,10],[147,11,147,15],[147,17,147,22],[147,23,147,24],[147,25,147,29],[146,3,146,8],[146,9,146,10],[146,11,146,15],[146,17,146,22],[146,23,146,24],[146,25,146,29],[151,3,151,8],[151,9,151,10],[151,11,151,15],[151,17,151,22],[151,23,151,24],[151,25,151,29],[150,3,150,8],[150,9,150,10],[150,11,150,15],[150,17,150,22],[150,23,150,24],[150,25,150,29],[149,3,149,8],[149,9,149,10],[149,11,149,15],[149,17,149,22],[149,23,149,24],[149,25,149,29],[154,3,154,8],[154,9,154,10],[154,11,154,15],[154,17,154,22],[154,23,154,24],[154,25,154,29],[153,3,153,8],[153,9,153,10],[153,11,153,15],[153,17,153,22],[153,23,153,24],[153,25,153,29],[152,3,152,8],[152,9,152,10],[152,11,152,15],[152,17,152,22],[152,23,152,24],[152,25,152,29],[157,3,157,8],[157,9,157,10],[157,11,157,15],[157,17,157,22],[157,23,157,24],[157,25,157,29],[156,3,156,8],[156,9,156,10],[156,11,156,15],[156,17,156,22],[156,23,156,24],[156,25,156,29],[155,3,155,8],[155,9,155,10],[155,11,155,15],[155,17,155,22],[155,23,155,24],[155,25,155,29],[160,3,160,8],[160,9,160,10],[160,11,160,15],[160,17,160,22],[160,23,160,24],[160,25,160,29],[159,3,159,8],[159,9,159,10],[159,11,159,15],[159,17,159,22],[159,23,159,24],[159,25,159,29],[158,3,158,8],[158,9,158,10],[158,11,158,15],[158,17,158,22],[158,23,158,24],[158,25,158,29],[163,3,163,8],[163,9,163,10],[163,11,163,15],[163,17,163,22],[163,23,163,24],[163,25,163,29],[162,3,162,8],[162,9,162,10],[162,11,162,15],[162,17,162,22],[162,23,162,24],[162,25,162,29],[161,3,161,8],[161,9,161,10],[161,11,161,15],[161,17,161,22],[161,23,161,24],[161,25,161,29],[166,3,166,8],[166,9,166,10],[166,11,166,15],[166,17,166,22],[166,23,166,24],[166,25,166,29],[165,3,165,8],[165,9,165,10],[165,11,165,15],[165,17,165,22],[165,23,165,24],[165,25,165,29],[164,3,164,8],[164,9,164,10],[164,11,164,15],[164,17,164,22],[164,23,164,24],[164,25,164,29],[169,3,169,8],[169,9,169,10],[169,11,169,15],[169,17,169,22],[169,23,169,24],[169,25,169,29],[168,3,168,8],[168,9,168,10],[168,11,168,15],[168,17,168,22],[168,23,168,24],[168,25,168,29],[167,3,167,8],[167,9,167,10],[167,11,167,15],[167,17,167,22],[167,23,167,24],[167,25,167,29],[172,3,172,8],[172,9,172,10],[172,11,172,15],[172,17,172,22],[172,23,172,24],[172,25,172,29],[171,3,171,8],[171,9,171,10],[171,11,171,15],[171,17,171,22],[171,23,171,24],[171,25,171,29],[170,3,170,8],[170,9,170,10],[170,11,170,15],[170,17,170,22],[170,23,170,24],[170,25,170,29],[175,3,175,8],[175,9,175,10],[175,11,175,15],[175,17,175,22],[175,23,175,24],[175,25,175,29],[174,3,174,8],[174,9,174,10],[174,11,174,15],[174,17,174,22],[174,23,174,24],[174,25,174,29],[173,3,173,8],[173,9,173,10],[173,11,173,15],[173,17,173,22],[173,23,173,24],[173,25,173,29],[178,3,178,8],[178,9,178,10],[178,11,178,15],[178,17,178,22],[178,23,178,24],[178,25,178,29],[177,3,177,8],[177,9,177,10],[177,11,177,15],[177,17,177,22],[177,23,177,24],[177,25,177,29],[176,3,176,8],[176,9,176,10],[176,11,176,15],[176,17,176,22],[176,23,176,24],[176,25,176,29],[181,3,181,8]],"merged_total":1665,"flags":["merged_cut"]}
[null,"CENSO NACIONAL DE GOBIERNOS\nESTATALES 2023"]
[]
[null,"Módulo 7.\nCatastro, registro y territorio"]
[]
[null,"Sección II. Registro Público de la Propiedad"]
[]
[null,"Complemento 1"]
[]
[null,"Entidad:",null,null,null,null,null,null,null,null,null,null,null,"Clave:",null,null,null,null,null,null,null,null,null,null,null,null,"Índice"]
[null,{"$f":"IF(Presentación!B10=\"\",\"\",Presentación!B10)","v":"Veracruz de Ignacio de la Llave"},null,null,null,null,null,null,null,null,null,null,null,{"$f":"Presentación!N10","v":"30"}]
[]
[null,null,"Esta tabla corresponde a la pregunta 2.7 \"Nombre de la oficina y municipios que fueron atendidos en su jurisdicción\"."]
[]
[null,null,"Municipios/demarcaciones territoriales atendidos por la oficina central"]
[null,null,"No","Nombre de la oficina central",null,null,null,null,null,"Clave",null,"Municipio/\ndemarcación territorial",null,null,null,null,"No","Nombre de la oficina central",null,null,null,null,null,"Clave",null,"Municipio/\ndemarcación territorial"]
[null,null,"21.",null,null,null,null,null,null,{"$f":"IF(ISBLANK(L16),\"\",VLOOKUP(L16,INDIRECT(CONCATENATE(\"LC_\",RIGHT($N$10,2))),2,FALSE))","v":""},null,null,null,null,null,null,"296.",null,null,null,null,null,null,{"$f":"IF(ISBLANK(Z16),\"\",VLOOKUP(Z16,INDIRECT(CONCATENATE(\"LC_\",RIGHT($N$10,2))),2,FALSE))","v":""}]
[null,null,"22.",null,null,null,null,null,null,{"$f":"IF(ISBLANK(L17),\"\",VLOOKUP(L17,INDIRECT(CONCATENATE(\"LC_\",RIGHT($N$10,2))),2,FALSE))","v":""},null,null,null,null,null,null,"297.",null,null,null,null,null,null,{"$f":"IF(ISBLANK(Z17),\"\",VLOOKUP(Z17,INDIRECT(CONCATENATE(\"LC_\",RIGHT($N$10,2))),2,FALSE))","v":""}]
[null,null,"23.",null,null,null,null,null,null,"",null,null,null,null,null,null,"298.",null,null,null,null,null,null,""]
[null,null,"24.",null,null,null,null,null,null,"",null,null,null,null,null,null,"299.",null,null,null,null,null,null,""]
[null,null,"25.",null,null,null,null,null,null,"",null,null,null,null,null,null,"300.",null,null,null,null,null,null,""]
[null,null,"26.",null,null,null,null,null,null,"",null,null,null,null,null,null,"301.",null,null,null,null,null,null,""]
[null,null,"27.",null,null,null,null,null,null,"",null,null,null,null,null,null,"302.",null,null,null,null,null,null,""]
[null,null,"28.",null,null,null,null,null,null,"",null,null,null,null,null,null,"303.",null,null,null,null,null,null,""]
[null,null,"29.",null,null,null,null,null,null,"",null,null,null,null,null,null,"304.",null,null,null,null,null,null,""]
[null,null,"30.",null,null,null,null,null,null,"",null,null,null,null,null,null,"305.",null,null,null,null,null,null,""]
[null,null,"31.",null,null,null,null,null,null,"",null,null,null,null,null,null,"306.",null,null,null,null,null,null,""]
[null,null,"32.",null,null,null,null,null,null,"",null,null,null,null,null,null,"307.",null,null,null,null,null,null,""]
[null,null,"33.",null,null,null,null,null,null,"",null,null,null,null,null,null,"308.",null,null,null,null,null,null,""]
[null,null,"34.",null,null,null,null,null,null,"",null,null,null,null,null,null,"309.",null,null,null,null,null,null,""]
[null,null,"35.",null,null,null,null,null,null,"",null,null,null,null,null,null,"310.",null,null,null,null,null,null,""]
[null,null,"36.",null,null,null,null,null,null,"",null,null,null,null,null,null,"311.",null,null,null,null,null,null,""]
[null,null,"37.",null,null,null,null,null,null,"",null,null,null,null,null,null,"312.",null,null,null,null,null,null,""]
[null,null,"38.",null,null,null,null,null,null,"",null,null,null,null,null,null,"313.",null,null,null,null,null,null,""]
[null,null,"39.",null,null,null,null,null,null,"",null,null,null,null,null,null,"314.",null,null,null,null,null,null,""]
[null,null,"40.",null,null,null,null,null,null,"",null,null,null,null,null,null,"315.",null,null,null,null,null,null,""]
[null,null,"41.",null,null,null,null,null,null,"",null,null,null,null,null,null,"316.",null,null,null,null,null,null,""]
[null,null,"42.",null,null,null,null,null,null,"",null,null,null,null,null,null,"317.",null,null,null,null,null,null,""]
[null,null,"43.",null,null,null,null,null,null,"",null,null,null,null,null,null,"318.",null,null,null,null,null,null,""]
[null,null,"44.",null,null,null,null,null,null,"",null,null,null,null,null,null,"319.",null,null,null,null,null,null,""]
[null,null,"45.",null,null,null,null,null,null,"",null,null,null,null,null,null,"320.",null,null,null,null,null,null,""]
[null,null,"46.",null,null,null,null,null,null,"",null,null,null,null,null,null,"321.",null,null,null,null,null,null,""]
[null,null,"47.",null,null,null,null,null,null,"",null,null,null,null,null,null,"322.",null,null,null,null,null,null,""]
[null,null,"48.",null,null,null,null,null,null,"",null,null,null,null,null,null,"323.",null,null,null,null,null,null,""]
[null,null,"49.",null,null,null,null,null,null,"",null,null,null,null,null,null,"324.",null,null,null,null,null,null,""]
[null,null,"50.",null,null,null,null,null,null,"",null,null,null,null,null,null,"325.",null,null,null,null,null,null,""]
[null,null,"51.",null,null,null,null,null,null,"",null,null,null,null,null,null,"326.",null,null,null,null,null,null,""]
[null,null,"52",null,null,null,null,null,null,"",null,null,null,null,null,null,"327.",null,null,null,null,null,null,""]
[null,null,"53.",null,null,null,null,null,null,"",null,null,null,null,null,null,"328.",null,null,null,null,null,null,""]
[null,null,"54.",null,null,null,null,null,null,"",null,null,null,null,null,null,"329.",null,null,null,null,null,null,""]
[null,null,"55.",null,null,null,null,null,null,"",null,null,null,null,null,null,"330.",null,null,null,null,null,null,""]
[null,null,"56.",null,null,null,null,null,null,"",null,null,null,null,null,null,"331.",null,null,null,null,null,null,""]
[null,null,"57.",null,null,null,null,null,null,"",null,null,null,null,null,null,"332.",null,null,null,null,null,null,""]
[null,null,"58.",null,null,null,null,null,null,"",null,null,null,null,null,null,"333.",null,null,null,null,null,null,""]
[null,null,"59.",null,null,null,null,null,null,"",null,null,null,null,null,null,"334.",null,null,null,null,null,null,""]
[null,null,"60.",null,null,null,null,null,null,"",null,null,null,null,null,null,"335.",null,null,null,null,null,null,""]
[null,null,"61.",null,null,null,null,null,null,"",null,null,null,null,null,null,"336.",null,null,null,null,null,null,""]
[null,null,"62.",null,null,null,null,null,null,"",null,null,null,null,null,null,"337.",null,null,null,null,null,null,""]
[null,null,"63.",null,null,null,null,null,null,"",null,null,null,null,null,null,"338.",null,null,null,null,null,null,""]
[null,null,"64.",null,null,null,null,null,null,"",null,null,null,null,null,null,"339.",null,null,null,null,null,null,""]
[null,null,"65.",null,null,null,null,null,null,"",null,null,null,null,null,null,"340.",null,null,null,null,null,null,""]
[null,null,"66.",null,null,null,null,null,null,"",null,null,null,null,null,null,"341.",null,null,null,null,null,null,""]
[null,null,"67.",null,null,null,null,null,null,"",null,null,null,null,null,null,"342.",null,null,null,null,null,null,""]
[null,null,"68.",null,null,null,null,null,null,"",null,null,null,null,null,null,"343.",null,null,null,null,null,null,""]
[null,null,"69.",null,null,null,null,null,null,"",null,null,null,null,null,null,"344.",null,null,null,null,null,null,""]
[null,null,"70.",null,null,null,null,null,null,"",null,null,null,null,null,null,"345.",null,null,null,null,null,null,""]
[null,null,"71.",null,null,null,null,null,null,"",null,null,null,null,null,null,"346.",null,null,null,null,null,null,""]
[null,null,"72.",null,null,null,null,null,null,"",null,null,null,null,null,null,"347.",null,null,null,null,null,null,""]
[null,null,"73.",null,null,null,null,null,null,"",null,null,null,null,null,null,"348.",null,null,null,null,null,null,""]
[null,null,"74.",null,null,null,null,null,null,"",null,null,null,null,null,null,"349.",null,null,null,null,null,null,""]
[null,null,"75.",null,null,null,null,null,null,"",null,null,null,null,null,null,"350.",null,null,null,null,null,null,""]
[null,null,"76.",null,null,null,null,null,null,"",null,null,null,null,null,null,"351.",null,null,null,null,null,null,""]
[null,null,"77.",null,null,null,null,null,null,"",null,null,null,null,null,null,"352.",null,null,null,null,null,null,""]
[null,null,"78.",null,null,null,null,null,null,"",null,null,null,null,null,null,"353.",null,null,null,null,null,null,""]
[null,null,"79.",null,null,null,null,null,null,"",null,null,null,null,null,null,"354.",null,null,null,null,null,null,""]
[null,null,"80.",null,null,null,null,null,null,"",null,null,null,null,null,null,"355.",null,null,null,null,null,null,""]
[null,null,"81.",null,null,null,null,null,null,"",null,null,null,null,null,null,"356.",null,null,null,null,null,null,""]
[null,null,"82.",null,null,null,null,null,null,"",null,null,null,null,null,null,"357.",null,null,null,null,null,null,""]
[null,null,"83.",null,null,null,null,null,null,"",null,null,null,null,null,null,"358.",null,null,null,null,null,null,""]
[null,null,"84.",null,null,null,null,null,null,"",null,null,null,null,null,null,"359.",null,null,null,null,null,null,""]
[null,null,"85.",null,null,null,null,null,null,"",null,null,null,null,null,null,"360.",null,null,null,null,null,null,""]
[null,null,"86.",null,null,null,null,null,null,{"$f":"IF(ISBLANK(L81),\"\",VLOOKUP(L81,INDIRECT(CONCATENATE(\"LC_\",RIGHT($N$10,2))),2,FALSE))","v":""},null,null,null,null,null,null,"361.",null,null,null,null,null,null,{"$f":"IF(ISBLANK(Z81),\"\",VLOOKUP(Z81,INDIRECT(CONCATENATE(\"LC_\",RIGHT($N$10,2))),2,FALSE))","v":""}]
[null,null,"87.",null,null,null,null,null,null,"",null,null,null,null,null,null,"362.",null,null,null,null,null,null,""]
[null,null,"88.",null,null,null,null,null,null,"",null,null,null,null,null,null,"363.",null,null,null,null,null,null,""]
[null,null,"89.",null,null,null,null,null,null,"",null,null,null,null,null,null,"364.",null,null,null,null,null,null,""]
[null,null,"90.",null,null,null,null,null,null,"",null,null,null,null,null,null,"365.",null,null,null,null,null,null,""]
[null,null,"91.",null,null,null,null,null,null,"",null,null,null,null,null,null,"366.",null,null,null,null,null,null,""]
[null,null,"92.",null,null,null,null,null,null,"",null,null,null,null,null,null,"367.",null,null,null,null,null,null,""]
[null,null,"93.",null,null,null,null,null,null,"",null,null,null,null,null,null,"368.",null,null,null,null,null,null,""]
[null,null,"94.",null,null,null,null,null,null,"",null,null,null,null,null,null,"369.",null,null,null,null,null,null,""]
[null,null,"95.",null,null,null,null,null,null,"",null,null,null,null,null,null,"370.",null,null,null,null,null,null,""]
[null,null,"96.",null,null,null,null,null,null,"",null,null,null,null,null,null,"371.",null,null,null,null,null,null,""]
[null,null,"97.",null,null,null,null,null,null,"",null,null,null,null,null,null,"372.",null,null,null,null,null,null,""]
[null,null,"98.",null,null,null,null,null,null,"",null,null,null,null,null,null,"373.",null,null,null,null,null,null,""]
[null,null,"99.",null,null,null,null,null,null,"",null,null,null,null,null,null,"374.",null,null,null,null,null,null,""]
[null,null,"100.",null,null,null,null,null,null,"",null,null,null,null,null,null,"375.",null,null,null,null,null,null,""]
[null,null,"101.",null,null,null,null,null,null,"",null,null,null,null,null,null,"376.",null,null,null,null,null,null,""]
[null,null,"102.",null,null,null,null,null,null,"",null,null,null,null,null,null,"377.",null,null,null,null,null,null,""]
[null,null,"103.",null,null,null,null,null,null,"",null,null,null,null,null,null,"378.",null,null,null,null,null,null,""]
[null,null,"104.",null,null,null,null,null,null,"",null,null,null,null,null,null,"379.",null,null,null,null,null,null,""]
[null,null,"105.",null,null,null,null,null,null,"",null,null,null,null,null,null,"380.",null,null,null,null,null,null,""]
[null,null,"106.",null,null,null,null,null,null,"",null,null,null,null,null,null,"381.",null,null,null,null,null,null,""]
[null,null,"107.",null,null,null,null,null,null,"",null,null,null,null,null,null,"382.",null,null,null,null,null,null,""]
[null,null,"108.",null,null,null,null,null,null,"",null,null,null,null,null,null,"383.",null,null,null,null,null,null,""]
[null,null,"109.",null,null,null,null,null,null,"",null,null,null,null,null,null,"384.",null,null,null,null,null,null,""]
[null,null,"110.",null,null,null,null,null,null,"",null,null,null,null,null,null,"385.",null,null,null,null,null,null,""]
[null,null,"111.",null,null,null,null,null,null,"",null,null,null,null,null,null,"386.",null,null,null,null,null,null,""]
[null,null,"112.",null,null,null,null,null,null,"",null,null,null,null,null,null,"387.",null,null,null,null,null,null,""]
[null,null,"113.",null,null,null,null,null,null,"",null,null,null,null,null,null,"388.",null,null,null,null,null,null,""]
[null,null,"114.",null,null,null,null,null,null,"",null,null,null,null,null,null,"389.",null,null,null,null,null,null,""]
[null,null,"115.",null,null,null,null,null,null,"",null,null,null,null,null,null,"390.",null,null,null,null,null,null,""]
[null,null,"116.",null,null,null,null,null,null,"",null,null,null,null,null,null,"391.",null,null,null,null,null,null,""]
[null,null,"117.",null,null,null,null,null,null,"",null,null,null,null,null,null,"392.",null,null,null,null,null,null,""]
[null,null,"118.",null,null,null,null,null,null,"",null,null,null,null,null,null,"393.",null,null,null,null,null,null,""]
[null,null,"119.",null,null,null,null,null,null,"",null,null,null,null,null,null,"394.",null,null,null,null,null,null,""]
[null,null,"120.",null,null,null,null,null,null,"",null,null,null,null,null,null,"395.",null,null,null,null,null,null,""]
[null,null,"121.",null,null,null,null,null,null,"",null,null,null,null,null,null,"396.",null,null,null,null,null,null,""]
[null,null,"122.",null,null,null,null,null,null,"",null,null,null,null,null,null,"397.",null,null,null,null,null,null,""]
[null,null,"123.",null,null,null,null,null,null,"",null,null,null,null,null,null,"398.",null,null,null,null,null,null,""]
[null,null,"124.",null,null,null,null,null,null,"",null,null,null,null,null,null,"399.",null,null,null,null,null,null,""]
[null,null,"125.",null,null,null,null,null,null,"",null,null,null,null,null,null,"400.",null,null,null,null,null,null,""]
[null,null,"126.",null,null,null,null,null,null,"",null,null,null,null,null,null,"401.",null,null,null,null,null,null,""]
[null,null,"127.",null,null,null,null,null,null,"",null,null,null,null,null,null,"402.",null,null,null,null,null,null,""]
[null,null,"128.",null,null,null,null,null,null,"",null,null,null,null,null,null,"403.",null,null,null,null,null,null,""]
[null,null,"129.",null,null,null,null,null,null,"",null,null,null,null,null,null,"404.",null,null,null,null,null,null,""]
[null,null,"130.",null,null,null,null,null,null,"",null,null,null,null,null,null,"405.",null,null,null,null,null,null,""]
[null,null,"131.",null,null,null,null,null,null,"",null,null,null,null,null,null,"406.",null,null,null,null,null,null,""]
[null,null,"132.",null,null,null,null,null,null,"",null,null,null,null,null,null,"407.",null,null,null,null,null,null,""]
[null,null,"133.",null,null,null,null,null,null,"",null,null,null,null,null,null,"408.",null,null,null,null,null,null,""]
[null,null,"134.",null,null,null,null,null,null,"",null,null,null,null,null,null,"409.",null,null,null,null,null,null,""]
[null,null,"135.",null,null,null,null,null,null,"",null,null,null,null,null,null,"410.",null,null,null,null,null,null,""]
[null,null,"136.",null,null,null,null,null,null,"",null,null,null,null,null,null,"411.",null,null,null,null,null,null,""]
[null,null,"137.",null,null,null,null,null,null,"",null,null,null,null,null,null,"412.",null,null,null,null,null,null,""]
[null,null,"138.",null,null,null,null,null,null,"",null,null,null,null,null,null,"413.",null,null,null,null,null,null,""]
[null,null,"139.",null,null,null,null,null,null,"",null,null,null,null,null,null,"414.",null,null,null,null,null,null,""]
[null,null,"140.",null,null,null,null,null,null,"",null,null,null,null,null,null,"415.",null,null,null,null,null,null,""]
[null,null,"141.",null,null,null,null,null,null,"",null,null,null,null,null,null,"416.",null,null,null,null,null,null,""]
[null,null,"142.",null,null,null,null,null,null,"",null,null,null,null,null,null,"417.",null,null,null,null,null,null,""]
[null,null,"143.",null,null,null,null,null,null,"",null,null,null,null,null,null,"418.",null,null,null,null,null,null,""]
[null,null,"144.",null,null,null,null,null,null,"",null,null,null,null,null,null,"419.",null,null,null,null,null,null,""]
[null,null,"145.",null,null,null,null,null,null,"",null,null,null,null,null,null,"420.",null,null,null,null,null,null,""]
[null,null,"146.",null,null,null,null,null,null,"",null,null,null,null,null,null,"421.",null,null,null,null,null,null,""]
[null,null,"147.",null,null,null,null,null,null,"",null,null,null,null,null,null,"422.",null,null,null,null,null,null,""]
[null,null,"148.",null,null,null,null,null,null,"",null,null,null,null,null,null,"423.",null,null,null,null,null,null,""]
[null,null,"149.",null,null,null,null,null,null,"",null,null,null,null,null,null,"424.",null,null,null,null,null,null,""]
[null,null,"150.",null,null,null,null,null,null,{"$f":"IF(ISBLANK(L145),\"\",VLOOKUP(L145,INDIRECT(CONCATENATE(\"LC_\",RIGHT($N$10,2))),2,FALSE))","v":""},null,null,null,null,null,null,"425.",null,null,null,null,null,null,{"$f":"IF(ISBLANK(Z145),\"\",VLOOKUP(Z145,INDIRECT(CONCATENATE(\"LC_\",RIGHT($N$10,2))),2,FALSE))","v":""}]
[null,null,"151.",null,null,null,null,null,null,"",null,null,null,null,null,null,"426.",null,null,null,null,null,null,""]
[null,null,"152.",null,null,null,null,null,null,{"$f":"IF(ISBLANK(L147),\"\",VLOOKUP(L147,INDIRECT(CONCATENATE(\"LC_\",RIGHT($N$10,2))),2,FALSE))","v":""},null,null,null,null,null,null,"427.",null,null,null,null,null,null,""]
[null,null,"153.",null,null,null,null,null,null,{"$f":"IF(ISBLANK(L148),\"\",VLOOKUP(L148,INDIRECT(CONCATENATE(\"LC_\",RIGHT($N$10,2))),2,FALSE))","v":""},null,null,null,null,null,null,"428.",null,null,null,null,null,null,""]
[null,null,"154.",null,null,null,null,null,null,"",null,null,null,null,null,null,"429.",null,null,null,null,null,null,""]
[null,null,"155.",null,null,null,null,null,null,"",null,null,null,null,null,null,"430.",null,null,null,null,null,null,""]
[null,null,"156.",null,null,null,null,null,null,"",null,null,null,null,null,null,"431.",null,null,null,null,null,null,""]
[null,null,"157.",null,null,null,null,null,null,"",null,null,null,null,null,null,"432.",null,null,null,null,null,null,""]
[null,null,"158.",null,null,null,null,null,null,"",null,null,null,null,null,null,"433.",null,null,null,null,null,null,""]
[null,null,"159.",null,null,null,null,null,null,"",null,null,null,null,null,null,"434.",null,null,null,null,null,null,""]
[null,null,"160.",null,null,null,null,null,null,"",null,null,null,null,null,null,"435.",null,null,null,null,null,null,""]
[null,null,"161.",null,null,null,null,null,null,"",null,null,null,null,null,null,"436.",null,null,null,null,null,null,""]
[null,null,"162.",null,null,null,null,null,null,"",null,null,null,null,null,null,"437.",null,null,null,null,null,null,""]
[null,null,"163.",null,null,null,null,null,null,"",null,null,null,null,null,null,"438.",null,null,null,null,null,null,""]
[null,null,"164.",null,null,null,null,null,null,"",null,null,null,null,null,null,"439.",null,null,null,null,null,null,""]
[null,null,"165.",null,null,null,null,null,null,"",null,null,null,null,null,null,"440.",null,null,null,null,null,null,""]
[null,null,"166.",null,null,null,null,null,null,"",null,null,null,null,null,null,"441.",null,null,null,null,null,null,""]
[null,null,"167.",null,null,null,null,null,null,"",null,null,null,null,null,null,"442.",null,null,null,null,null,null,""]
[null,null,"168.",null,null,null,null,null,null,"",null,null,null,null,null,null,"443.",null,null,null,null,null,null,""]
[null,null,"169.",null,null,null,null,null,null,"",null,null,null,null,null,null,"444.",null,null,null,null,null,null,""]
[null,null,"170.",null,null,null,null,null,null,"",null,null,null,null,null,null,"445.",null,null,null,null,null,null,""]
[null,null,"171.",null,null,null,null,null,null,"",null,null,null,null,null,null,"446.",null,null,null,null,null,null,""]
[null,null,"172.",null,null,null,null,null,null,"",null,null,null,null,null,null,"447.",null,null,null,null,null,null,""]
[null,null,"173.",null,null,null,null,null,null,"",null,null,null,null,null,null,"448.",null,null,null,null,null,null,""]
[null,null,"174.",null,null,null,null,null,null,"",null,null,null,null,null,null,"449.",null,null,null,null,null,null,""]
[null,null,"175.",null,null,null,null,null,null,"",null,null,null,null,null,null,"450.",null,null,null,null,null,null,""]
[null,null,"176.",null,null,null,null,null,null,"",null,null,null,null,null,null,"451.",null,null,null,null,null,null,""]
[null,null,"177.",null,null,null,null,null,null,"",null,null,null,null,null,null,"452.",null,null,null,null,null,null,""]
[null,null,"178.",null,null,null,null,null,null,"",null,null,null,null,null,null,"453.",null,null,null,null,null,null,""]
[null,null,"179.",null,null,null,null,null,null,"",null,null,null,null,null,null,"454.",null,null,null,null,null,null,""]
[null,null,"180.",null,null,null,null,null,null,"",null,null,null,null,null,null,"455.",null,null,null,null,null,null,""]
[null,null,"181.",null,null,null,null,null,null,"",null,null,null,null,null,null,"456.",null,null,null,null,null,null,""]
[null,null,"182.",null,null,null,null,null,null,"",null,null,null,null,null,null,"457.",null,null,null,null,null,null,""]
[null,null,"183.",null,null,null,null,null,null,"",null,null,null,null,null,null,"458.",null,null,null,null,null,null,""]
[null,null,"184.",null,null,null,null,null,null,"",null,null,null,null,null,null,"459.",null,null,null,null,null,null,""]
[null,null,"185.",null,null,null,null,null,null,"",null,null,null,null,null,null,"460.",null,null,null,null,null,null,""]
[null,null,"186.",null,null,null,null,null,null,"",null,null,null,null,null,null,"461.",null,null,null,null,null,null,""]
[null,null,"187.",null,null,null,null,null,null,"",null,null,null,null,null,null,"462.",null,null,null,null,null,null,""]
[null,null,"188.",null,null,null,null,null,null,"",null,null,null,null,null,null,"463.",null,null,null,null,null,null,""]
[null,null,"189.",null,null,null,null,null,null,"",null,null,null,null,null,null,"464.",null,null,null,null,null,null,""]
[null,null,"190.",null,null,null,null,null,null,"",null,null,null,null,null,null,"465.",null,null,null,null,null,null,""]
[null,null,"191.",null,null,null,null,null,null,"",null,null,null,null,null,null,"466.",null,null,null,null,null,null,""]
[null,null,"192.",null,null,null,null,null,null,"",null,null,null,null,null,null,"467.",null,null,null,null,null,null,""]
[null,null,"193.",null,null,null,null,null,null,"",null,null,null,null,null,null,"468.",null,null,null,null,null,null,""]
[null,null,"194.",null,null,null,null,null,null,"",null,null,null,null,null,null,"469.",null,null,null,null,null,null,""]
[null,null,"195.",null,null,null,null,null,null,"",null,null,null,null,null,null,"470.",null,null,null,null,null,null,""]
[null,null,"196.",null,null,null,null,null,null,"",null,null,null,null,null,null,"471.",null,null,null,null,null,null,""]
[null,null,"197.",null,null,null,null,null,null,"",null,null,null,null,null,null,"472.",null,null,null,null,null,null,""]
[null,null,"198.",null,null,null,null,null,null,"",null,null,null,null,null,null,"473.",null,null,null,null,null,null,""]
[null,null,"199.",null,null,null,null,null,null,"",null,null,null,null,null,null,"474.",null,null,null,null,null,null,""]
[null,null,"200.",null,null,null,null,null,null,"",null,null,null,null,null,null,"475.",null,null,null,null,null,null,""]
[null,null,"201.",null,null,null,null,null,null,"",null,null,null,null,null,null,"476.",null,null,null,null,null,null,""]
[null,null,"202.",null,null,null,null,null,null,"",null,null,null,null,null,null,"477.",null,null,null,null,null,null,""]
[null,null,"203.",null,null,null,null,null,null,"",null,null,null,null,null,null,"478.",null,null,null,null,null,null,""]
[null,null,"204.",null,null,null,null,null,null,"",null,null,null,null,null,null,"479.",null,null,null,null,null,null,""]
[null,null,"205.",null,null,null,null,null,null,"",null,null,null,null,null,null,"480.",null,null,null,null,null,null,""]
[null,null,"206.",null,null,null,null,null,null,"",null,null,null,null,null,null,"481.",null,null,null,null,null,null,""]
[null,null,"207.",null,null,null,null,null,null,"",null,null,null,null,null,null,"482.",null,null,null,null,null,null,""]
[null,null,"208.",null,null,null,null,null,null,"",null,null,null,null,null,null,"483.",null,null,null,null,null,null,""]
[null,null,"209.",null,null,null,null,null,null,"",null,null,null,null,null,null,"484.",null,null,null,null,null,null,""]
[null,null,"210.",null,null,null,null,null,null,"",null,null,null,null,null,null,"485.",null,null,null,null,null,null,""]
[null,null,"211.",null,null,null,null,null,null,"",null,null,null,null,null,null,"486.",null,null,null,null,null,null,""]
[null,null,"212.",null,null,null,null,null,null,"",null,null,null,null,null,null,"487.",null,null,null,null,null,null,""]
[null,null,"213.",null,null,null,null,null,null,"",null,null,null,null,null,null,"488.",null,null,null,null,null,null,""]
[null,null,"214.",null,null,null,null,null,null,{"$f":"IF(ISBLANK(L209),\"\",VLOOKUP(L209,INDIRECT(CONCATENATE(\"LC_\",RIGHT($N$10,2))),2,FALSE))","v":""},null,null,null,null,null,null,"489.",null,null,null,null,null,null,{"$f":"IF(ISBLANK(Z209),\"\",VLOOKUP(Z209,INDIRECT(CONCATENATE(\"LC_\",RIGHT($N$10,2))),2,FALSE))","v":""}]
[null,null,"215.",null,null,null,null,null,null,"",null,null,null,null,null,null,"490.",null,null,null,null,null,null,""]
[null,null,"216.",null,null,null,null,null,null,"",null,null,null,null,null,null,"491.",null,null,null,null,null,null,""]
[null,null,"217.",null,null,null,null,null,null,"",null,null,null,null,null,null,"492.",null,null,null,null,null,null,""]
[null,null,"218.",null,null,null,null,null,null,"",null,null,null,null,null,null,"493.",null,null,null,null,null,null,""]
[null,null,"219.",null,null,null,null,null,null,"",null,null,null,null,null,null,"494.",null,null,null,null,null,null,""]
[null,null,"220.",null,null,null,null,null,null,"",null,null,null,null,null,null,"495.",null,null,null,null,null,null,""]
[null,null,"221.",null,null,null,null,null,null,"",null,null,null,null,null,null,"496.",null,null,null,null,null,null,""]
[null,null,"222.",null,null,null,null,null,null,"",null,null,null,null,null,null,"497.",null,null,null,null,null,null,""]
[null,null,"223.",null,null,null,null,null,null,"",null,null,null,null,null,null,"498.",null,null,null,null,null,null,""]
[null,null,"224.",null,null,null,null,null,null,"",null,null,null,null,null,null,"499.",null,null,null,null,null,null,""]
[null,null,"225.",null,null,null,null,null,null,"",null,null,null,null,null,null,"500.",null,null,null,null,null,null,""]
[null,null,"226.",null,null,null,null,null,null,"",null,null,null,null,null,null,"501.",null,null,null,null,null,null,""]
[null,null,"227.",null,null,null,null,null,null,"",null,null,null,null,null,null,"502.",null,null,null,null,null,null,""]
[null,null,"228.",null,null,null,null,null,null,"",null,null,null,null,null,null,"503.",null,null,null,null,null,null,""]
[null,null,"229.",null,null,null,null,null,null,"",null,null,null,null,null,null,"504.",null,null,null,null,null,null,""]
[null,null,"230.",null,null,null,null,null,null,"",null,null,null,null,null,null,"505.",null,null,null,null,null,null,""]
[null,null,"231.",null,null,null,null,null,null,"",null,null,null,null,null,null,"506.",null,null,null,null,null,null,""]
[null,null,"232.",null,null,null,null,null,null,"",null,null,null,null,null,null,"507.",null,null,null,null,null,null,""]
[null,null,"233.",null,null,null,null,null,null,"",null,null,null,null,null,null,"508.",null,null,null,null,null,null,""]
[null,null,"234.",null,null,null,null,null,null,"",null,null,null,null,null,null,"509.",null,null,null,null,null,null,""]
[null,null,"235.",null,null,null,null,null,null,"",null,null,null,null,null,null,"510.",null,null,null,null,null,null,""]
[null,null,"236.",null,null,null,null,null,null,"",null,null,null,null,null,null,"511.",null,null,null,null,null,null,""]
[null,null,"237.",null,null,null,null,null,null,"",null,null,null,null,null,null,"512.",null,null,null,null,null,null,""]
[null,null,"238.",null,null,null,null,null,null,"",null,null,null,null,null,null,"513.",null,null,null,null,null,null,""]
[null,null,"239.",null,null,null,null,null,null,"",null,null,null,null,null,null,"514.",null,null,null,null,null,null,""]
[null,null,"240.",null,null,null,null,null,null,"",null,null,null,null,null,null,"515.",null,null,null,null,null,null,""]
[null,null,"241.",null,null,null,null,null,null,"",null,null,null,null,null,null,"516.",null,null,null,null,null,null,""]
[null,null,"242.",null,null,null,null,null,null,"",null,null,null,null,null,null,"517.",null,null,null,null,null,null,""]
[null,null,"243.",null,null,null,null,null,null,"",null,null,null,null,null,null,"518.",null,null,null,null,null,null,""]
[null,null,"244.",null,null,null,null,null,null,"",null,null,null,null,null,null,"519.",null,null,null,null,null,null,""]
[null,null,"245.",null,null,null,null,null,null,"",null,null,null,null,null,null,"520.",null,null,null,null,null,null,""]
[null,null,"246.",null,null,null,null,null,null,"",null,null,null,null,null,null,"521.",null,null,null,null,null,null,""]
[null,null,"247.",null,null,null,null,null,null,"",null,null,null,null,null,null,"522.",null,null,null,null,null,null,""]
[null,null,"248.",null,null,null,null,null,null,"",null,null,null,null,null,null,"523.",null,null,null,null,null,null,""]
[null,null,"249.",null,null,null,null,null,null,"",null,null,null,null,null,null,"524.",null,null,null,null,null,null,""]
[null,null,"250.",null,null,null,null,null,null,"",null,null,null,null,null,null,"525.",null,null,null,null,null,null,""]
[null,null,"251.",null,null,null,null,null,null,"",null,null,null,null,null,null,"526.",null,null,null,null,null,null,""]
[null,null,"252.",null,null,null,null,null,null,"",null,null,null,null,null,null,"527.",null,null,null,null,null,null,""]
[null,null,"253.",null,null,null,null,null,null,"",null,null,null,null,null,null,"528.",null,null,null,null,null,null,""]
[null,null,"254.",null,null,null,null,null,null,"",null,null,null,null,null,null,"529.",null,null,null,null,null,null,""]
[null,null,"255.",null,null,null,null,null,null,"",null,null,null,null,null,null,"530.",null,null,null,null,null,null,""]
[null,null,"256.",null,null,null,null,null,null,"",null,null,null,null,null,null,"531.",null,null,null,null,null,null,""]
[null,null,"257.",null,null,null,null,null,null,"",null,null,null,null,null,null,"532.",null,null,null,null,null,null,""]
[null,null,"258.",null,null,null,null,null,null,"",null,null,null,null,null,null,"533.",null,null,null,null,null,null,""]
[null,null,"259.",null,null,null,null,null,null,"",null,null,null,null,null,null,"534.",null,null,null,null,null,null,""]
[null,null,"260.",null,null,null,null,null,null,"",null,null,null,null,null,null,"535.",null,null,null,null,null,null,""]
[null,null,"261.",null,null,null,null,null,null,"",null,null,null,null,null,null,"536.",null,null,null,null,null,null,""]
[null,null,"262.",null,null,null,null,null,null,"",null,null,null,null,null,null,"537.",null,null,null,null,null,null,""]
[null,null,"263.",null,null,null,null,null,null,"",null,null,null,null,null,null,"538.",null,null,null,null,null,null,""]
[null,null,"264.",null,null,null,null,null,null,"",null,null,null,null,null,null,"539.",null,null,null,null,null,null,""]
[null,null,"265.",null,null,null,null,null,null,"",null,null,null,null,null,null,"540.",null,null,null,null,null,null,""]
[null,null,"266.",null,null,null,null,null,null,"",null,null,null,null,null,null,"541.",null,null,null,null,null,null,""]
[null,null,"267.",null,null,null,null,null,null,"",null,null,null,null,null,null,"542.",null,null,null,null,null,null,""]
[null,null,"268.",null,null,null,null,null,null,"",null,null,null,null,null,null,"543.",null,null,null,null,null,null,""]
[null,null,"269.",null,null,null,null,null,null,"",null,null,null,null,null,null,"544.",null,null,null,null,null,null,""]
[null,null,"270.",null,null,null,null,null,null,"",null,null,null,null,null,null,"545.",null,null,null,null,null,null,""]
[null,null,"271.",null,null,null,null,null,null,"",null,null,null,null,null,null,"546.",null,null,null,null,null,null,""]
[null,null,"272.",null,null,null,null,null,null,"",null,null,null,null,null,null,"547.",null,null,null,null,null,null,""]
[null,null,"273.",null,null,null,null,null,null,"",null,null,null,null,null,null,"548.",null,null,null,null,null,null,""]
[null,null,"274.",null,null,null,null,null,null,"",null,null,null,null,null,null,"549.",null,null,null,null,null,null,""]
[null,null,"275.",null,null,null,null,null,null,"",null,null,null,null,null,null,"550.",null,null,null,null,null,null,""]
[null,null,"276.",null,null,null,null,null,null,"",null,null,null,null,null,null,"551.",null,null,null,null,null,null,""]
[null,null,"277.",null,null,null,null,null,null,"",null,null,null,null,null,null,"552.",null,null,null,null,null,null,""]
[null,null,"278.",null,null,null,null,null,null,{"$f":"IF(ISBLANK(L273),\"\",VLOOKUP(L273,INDIRECT(CONCATENATE(\"LC_\",RIGHT($N$10,2))),2,FALSE))","v":""},null,null,null,null,null,null,"553.",null,null,null,null,null,null,{"$f":"IF(ISBLANK(Z273),\"\",VLOOKUP(Z273,INDIRECT(CONCATENATE(\"LC_\",RIGHT($N$10,2))),2,FALSE))","v":""}]
[null,null,"279.",null,null,null,null,null,null,"",null,null,null,null,null,null,"554.",null,null,null,null,null,null,""]
[null,null,"280.",null,null,null,null,null,null,"",null,null,null,null,null,null,"555.",null,null,null,null,null,null,""]
[null,null,"281.",null,null,null,null,null,null,"",null,null,null,null,null,null,"556.",null,null,null,null,null,null,""]
[null,null,"282.",null,null,null,null,null,null,"",null,null,null,null,null,null,"557.",null,null,null,null,null,null,""]
[null,null,"283.",null,null,null,null,null,null,"",null,null,null,null,null,null,"558.",null,null,null,null,null,null,""]
[null,null,"284.",null,null,null,null,null,null,"",null,null,null,null,null,null,"559.",null,null,null,null,null,null,""]
[null,null,"285.",null,null,null,null,null,null,"",null,null,null,null,null,null,"560.",null,null,null,null,null,null,""]
[null,null,"286.",null,null,null,null,null,null,"",null,null,null,null,null,null,"561.",null,null,null,null,null,null,""]
[null,null,"287.",null,null,null,null,null,null,"",null,null,null,null,null,null,"562.",null,null,null,null,null,null,""]
[null,null,"288.",null,null,null,null,null,null,"",null,null,null,null,null,null,"563.",null,null,null,null,null,null,""]
[null,null,"289.",null,null,null,null,null,null,"",null,null,null,null,null,null,"564.",null,null,null,null,null,null,""]
[null,null,"290.",null,null,null,null,null,null,"",null,null,null,null,null,null,"565.",null,null,null,null,null,null,""]
[null,null,"291.",null,null,null,null,null,null,"",null,null,null,null,null,null,"566.",null,null,null,null,null,null,""]
[null,null,"292.",null,null,null,null,null,null,"",null,null,null,null,null,null,"567.",null,null,null,null,null,null,""]
[null,null,"293.",null,null,null,null,null,null,"",null,null,null,null,null,null,"568.",null,null,null,null,null,null,""]
[null,null,"294.",null,null,null,null,null,null,"",null,null,null,null,null,null,"569.",null,null,null,null,null,null,""]
[null,null,"295.",null,null,null,null,null,null,"",null,null,null,null,null,null,"570.",null,null,null,null,null,null,""]

{"sheet":"Complemento 2","index":8,"n_rows":290,"n_cols":33,"rows_kept":290,"cut":false,"hidden":true,"merged":[[0,1,0,29],[2,1,2,29],[4,1,4,29],[6,1,6,29],[8,26,8,29],[9,1,9,11],[9,13,9,14],[16,3,16,8],[16,9,16,10],[16,11,16,15],[16,17,16,22],[16,23,16,24],[16,25,16,29],[15,3,15,8],[15,9,15,10],[15,11,15,15],[15,17,15,22],[15,23,15,24],[15,25,15,29],[11,2,11,29],[13,2,13,29],[14,3,14,8],[14,9,14,10],[14,11,14,15],[14,17,14,22],[14,23,14,24],[14,25,14,29],[19,3,19,8],[19,9,19,10],[19,11,19,15],[19,17,19,22],[19,23,19,24],[19,25,19,29],[18,3,18,8],[18,9,18,10],[18,11,18,15],[18,17,18,22],[18,23,18,24],[18,25,18,29],[17,3,17,8],[17,9,17,10],[17,11,17,15],[17,17,17,22],[17,23,17,24],[17,25,17,29],[22,3,22,8],[22,9,22,10],[22,11,22,15],[22,17,22,22],[22,23,22,24],[22,25,22,29],[21,3,21,8],[21,9,21,10],[21,11,21,15],[21,17,21,22],[21,23,21,24],[21,25,21,29],[20,3,20,8],[20,9,20,10],[20,11,20,15],[20,17,20,22],[20,23,20,24],[20,25,20,29],[25,3,25,8],[25,9,25,10],[25,11,25,15],[25,17,25,22],[25,23,25,24],[25,25,25,29],[24,3,24,8],[24,9,24,10],[24,11,24,15],[24,17,24,22],[24,23,24,24],[24,25,24,29],[23,3,23,8],[23,9,23,10],[23,11,23,15],[23,17,23,22],[23,23,23,24],[23,25,23,29],[28,3,28,8],[28,9,28,10],[28,11,28,15],[28,17,28,22],[28,23,28,24],[28,25,28,29],[27,3,27,8],[27,9,27,10],[27,11,27,15],[27,17,27,22],[27,23,27,24],[27,25,27,29],[26,3,26,8],[26,9,26,10],[26,11,26,15],[26,17,26,22],[26,23,26,24],[26,25,26,29],[31,3,31,8],[31,9,31,10],[31,11,31,15],[31,17,31,22],[31,23,31,24],[31,25,31,29],[30,3,30,8],[30,9,30,10],[30,11,30,15],[30,17,30,22],[30,23,30,24],[30,25,30,29],[29,3,29,8],[29,9,29,10],[29,11,29,15],[29,17,29,22],[29,23,29,24],[29,25,29,29],[34,3,34,8],[34,9,34,10],[34,11,34,15],[34,17,34,22],[34,23,34,24],[34,25,34,29],[33,3,33,8],[33,9,33,10],[33,11,33,15],[33,17,33,22],[33,23,33,24],[33,25,33,29],[32,3,32,8],[32,9,32,10],[32,11,32,15],[32,17,32,22],[32,23,32,24],[32,25,32,29],[37,3,37,8],[37,9,37,10],[37,11,37,15],[37,17,37,22],[37,23,37,24],[37,25,37,29],[36,3,36,8],[36,9,36,10],[36,11,36,15],[36,17,36,22],[36,23,36,24],[36,25,36,29],[35,3,35,8],[35,9,35,10],[35,11,35,15],[35,17,35,22],[35,23,35,24],[35,25,35,29],[40,3,40,8],[40,9,40,10],[40,11,40,15],[40,17,40,22],[40,23,40,24],[40,25,40,29],[39,3,39,8],[39,9,39,10],[39,11,39,15],[39,17,39,22],[39,23,39,24],[39,25,39,29],[38,3,38,8],[38,9,38,10],[38,11,38,15],[38,17,38,22],[38,23,38,24],[38,25,38,29],[43,3,43,8],[43,9,43,10],[43,11,43,15],[43,17,43,22],[43,23,43,24],[43,25,43,29],[42,3,42,8],[42,9,42,10],[42,11,42,15],[42,17,42,22],[42,23,42,24],[42,25,42,29],[41,3,41,8],[41,9,41,10],[41,11,41,15],[41,17,41,22],[41,23,41,24],[41,25,41,29],[46,3,46,8],[46,9,46,10],[46,11,46,15],[46,17,46,22],[46,23,46,24],[46,25,46,29],[45,3,45,8],[45,9,45,10],[45,11,45,15],[45,17,45,22],[45,23,45,24],[45,25,45,29],[44,3,44,8],[44,9,44,10],[44,11,44,15],[44,17,44,22],[44,23,44,24],[44,25,44,29],[49,3,49,8],[49,9,49,10],[49,11,49,15],[49,17,49,22],[49,23,49,24],[49,25,49,29],[48,3,48,8],[48,9,48,10],[48,11,48,15],[48,17,48,22],[48,23,48,24],[48,25,48,29],[47,3,47,8],[47,9,47,10],[47,11,47,15],[47,17,47,22],[47,23,47,24],[47,25,47,29],[52,3,52,8],[52,9,52,10],[52,11,52,15],[52,17,52,22],[52,23,52,24],[52,25,52,29],[51,3,51,8],[51,9,51,10],[51,11,51,15],[51,17,51,22],[51,23,51,24],[51,25,51,29],[50,3,50,8],[50,9,50,10],[50,11,50,15],[50,17,50,22],[50,23,50,24],[50,25,50,29],[55,3,55,8],[55,9,55,10],[55,11,55,15],[55,17,55,22],[55,23,55,24],[55,25,55,29],[54,3,54,8],[54,9,54,10],[54,11,54,15],[54,17,54,22],[54,23,54,24],[54,25,54,29],[53,3,53,8],[53,9,53,10],[53,11,53,15],[53,17,53,22],[53,23,53,24],[53,25,53,29],[58,3,58,8],[58,9,58,10],[58,11,58,15],[58,17,58,22],[58,23,58,24],[58,25,58,29],[57,3,57,8],[57,9,57,10],[57,11,57,15],[57,17,57,22],[57,23,57,24],[57,25,57,29],[56,3,56,8],[56,9,56,10],[56,11,56,15],[56,17,56,22],[56,23,56,24],[56,25,56,29],[61,3,61,8],[61,9,61,10],[61,11,61,15],[61,17,61,22],[61,23,61,24],[61,25,61,29],[60,3,60,8],[60,9,60,10],[60,11,60,15],[60,17,60,22],[60,23,60,24],[60,25,60,29],[59,3,59,8],[59,9,59,10],[59,11,59,15],[59,17,59,22],[59,23,59,24],[59,25,59,29],[64,3,64,8],[64,9,64,10],[64,11,64,15],[64,17,64,22],[64,23,64,24],[64,25,64,29],[63,3,63,8],[63,9,63,10],[63,11,63,15],[63,17,63,22],[63,23,63,24],[63,25,63,29],[62,3,62,8],[62,9,62,10],[62,11,62,15],[62,17,62,22],[62,23,62,24],[62,25,62,29],[67,3,67,8],[67,9,67,10],[67,11,67,15],[67,17,67,22],[67,23,67,24],[67,25,67,29],[66,3,66,8],[66,9,66,10],[66,11,66,15],[66,17,66,22],[66,23,66,24],[66,25,66,29],[65,3,65,8],[65,9,65,10],[65,11,65,15],[65,17,65,22],[65,23,65,24],[65,25,65,29],[70,3,70,8],[70,9,70,10],[70,11,70,15],[70,17,70,22],[70,23,70,24],[70,25,70,29],[69,3,69,8],[69,9,69,10],[69,11,69,15],[69,17,69,22],[69,23,69,24],[69,25,69,29],[68,3,68,8],[68,9,68,10],[68,11,68,15],[68,17,68,22],[68,23,68,24],[68,25,68,29],[73,3,73,8],[73,9,73,10],[73,11,73,15],[73,17,73,22],[73,23,73,24],[73,25,73,29],[72,3,72,8],[72,9,72,10],[72,11,72,15],[72,17,72,22],[72,23,72,24],[72,25,72,29],[71,3,71,8],[71,9,71,10],[71,11,71,15],[71,17,71,22],[71,23,71,24],[71,25,71,29],[76,3,76,8],[76,9,76,10],[76,11,76,15],[76,17,76,22],[76,23,76,24],[76,25,76,29],[75,3,75,8],[75,9,75,10],[75,11,75,15],[75,17,75,22],[75,23,75,24],[75,25,75,29],[74,3,74,8],[74,9,74,10],[74,11,74,15],[74,17,74,22],[74,23,74,24],[74,25,74,29],[79,3,79,8],[79,9,79,10],[79,11,79,15],[79,17,79,22],[79,23,79,24],[79,25,79,29],[78,3,78,8],[78,9,78,10],[78,11,78,15],[78,17,78,22],[78,23,78,24],[78,25,78,29],[77,3,77,8],[77,9,77,10],[77,11,77,15],[77,17,77,22],[77,23,77,24],[77,25,77,29],[82,3,82,8],[82,9,82,10],[82,11,82,15],[82,17,82,22],[82,23,82,24],[82,25,82,29],[81,3,81,8],[81,9,81,10],[81,11,81,15],[81,17,81,22],[81,23,81,24],[81,25,81,29],[80,3,80,8],[80,9,80,10],[80,11,80,15],[80,17,80,22],[80,23,80,24],[80,25,80,29],[85,3,85,8],[85,9,85,10],[85,11,85,15],[85,17,85,22],[85,23,85,24],[85,25,85,29],[84,3,84,8],[84,9,84,10],[84,11,84,15],[84,17,84,22],[84,23,84,24],[84,25,84,29],[83,3,83,8],[83,9,83,10],[83,11,83,15],[83,17,83,22],[83,23,83,24],[83,25,83,29],[88,3,88,8],[88,9,88,10],[88,11,88,15],[88,17,88,22],[88,23,88,24],[88,25,88,29],[87,3,87,8],[87,9,87,10],[87,11,87,15],[87,17,87,22],[87,23,87,24],[87,25,87,29],[86,3,86,8],[86,9,86,10],[86,11,86,15],[86,17,86,22],[86,23,86,24],[86,25,86,29],[91,3,91,8],[91,9,91,10],[91,11,91,15],[91,17,91,22],[91,23,91,24],[91,25,91,29],[90,3,90,8],[90,9,90,10],[90,11,90,15],[90,17,90,22],[90,23,90,24],[90,25,90,29],[89,3,89,8],[89,9,89,10],[89,11,89,15],[89,17,89,22],[89,23,89,24],[89,25,89,29],[94,3,94,8],[94,9,94,10],[94,11,94,15],[94,17,94,22],[94,23,94,24],[94,25,94,29],[93,3,93,8],[93,9,93,10],[93,11,93,15],[93,17,93,22],[93,23,93,24],[93,25,93,29],[92,3,92,8],[92,9,92,10],[92,11,92,15],[92,17,92,22],[92,23,92,24],[92,25,92,29],[97,3,97,8],[97,9,97,10],[97,11,97,15],[97,17,97,22],[97,23,97,24],[97,25,97,29],[96,3,96,8],[96,9,96,10],[96,11,96,15],[96,17,96,22],[96,23,96,24],[96,25,96,29],[95,3,95,8],[95,9,95,10],[95,11,95,15],[95,17,95,22],[95,23,95,24],[95,25,95,29],[100,3,100,8],[100,9,100,10],[100,11,100,15],[100,17,100,22],[100,23,100,24],[100,25,100,29],[99,3,99,8],[99,9,99,10],[99,11,99,15],[99,17,99,22],[99,23,99,24],[99,25,99,29],[98,3,98,8],[98,9,98,10],[98,11,98,15],[98,17,98,22],[98,23,98,24],[98,25,98,29],[103,3,103,8],[103,9,103,10],[103,11,103,15],[103,17,103,22],[103,23,103,24],[103,25,103,29],[102,3,102,8],[102,9,102,10],[102,11,102,15],[102,17,102,22],[102,23,102,24],[102,25,102,29],[101,3,101,8],[101,9,101,10],[101,11,101,15],[101,17,101,22],[101,23,101,24],[101,25,101,29],[106,3,106,8],[106,9,106,10],[106,11,106,15],[106,17,106,22],[106,23,106,24],[106,25,106,29],[105,3,105,8],[105,9,105,10],[105,11,105,15],[105,17,105,22],[105,23,105,24],[105,25,105,29],[104,3,104,8],[104,9,104,10],[104,11,104,15],[104,17,104,22],[104,23,104,24],[104,25,104,29],[109,3,109,8],[109,9,109,10],[109,11,109,15],[109,17,109,22],[109,23,109,24],[109,25,109,29],[108,3,108,8],[108,9,108,10],[108,11,108,15],[108,17,108,22],[108,23,108,24],[108,25,108,29],[107,3,107,8],[107,9,107,10],[107,11,107,15],[107,17,107,22],[107,23,107,24],[107,25,107,29],[112,3,112,8],[112,9,112,10],[112,11,112,15],[112,17,112,22],[112,23,112,24],[112,25,112,29],[111,3,111,8],[111,9,111,10],[111,11,111,15],[111,17,111,22],[111,23,111,24],[111,25,111,29],[110,3,110,8],[110,9,110,10],[110,11,110,15],[110,17,110,22],[110,23,110,24],[110,25,110,29],[115,3,115,8],[115,9,115,10],[115,11,115,15],[115,17,115,22],[115,23,115,24],[115,25,115,29],[114,3,114,8],[114,9,114,10],[114,11,114,15],[114,17,114,22],[114,23,114,24],[114,25,114,29],[113,3,113,8],[113,9,113,10],[113,11,113,15],[113,17,113,22],[113,23,113,24],[113,25,113,29],[118,3,118,8],[118,9,118,10],[118,11,118,15],[118,17,118,22],[118,23,118,24],[118,25,118,29],[117,3,117,8],[117,9,117,10],[117,11,117,15],[117,17,117,22],[117,23,117,24],[117,25,117,29],[116,3,116,8],[116,9,116,10],[116,11,116,15],[116,17,116,22],[116,23,116,24],[116,25,116,29],[121,3,121,8],[121,9,121,10],[121,11,121,15],[121,17,121,22],[121,23,121,24],[121,25,121,29],[120,3,120,8],[120,9,120,10],[120,11,120,15],[120,17,120,22],[120,23,120,24],[120,25,120,29],[119,3,119,8],[119,9,119,10],[119,11,119,15],[119,17,119,22],[119,23,119,24],[119,25,119,29],[124,3,124,8],[124,9,124,10],[124,11,124,15],[124,17,124,22],[124,23,124,24],[124,25,124,29],[123,3,123,8],[123,9,123,10],[123,11,123,15],[123,17,123,22],[123,23,123,24],[123,25,123,29],[122,3,122,8],[122,9,122,10],[122,11,122,15],[122,17,122,22],[122,23,122,24],[122,25,122,29],[127,3,127,8],[127,9,127,10],[127,11,127,15],[127,17,127,22],[127,23,127,24],[127,25,127,29],[126,3,126,8],[126,9,126,10],[126,11,126,15],[126,17,126,22],[126,23,126,24],[126,25,126,29],[125,3,125,8],[125,9,125,10],[125,11,125,15],[125,17,125,22],[125,23,125,24],[125,25,125,29],[130,3,130,8],[130,9,130,10],[130,11,130,15],[130,17,130,22],[130,23,130,24],[130,25,130,29],[129,3,129,8],[129,9,129,10],[129,11,129,15],[129,17,129,22],[129,23,129,24],[129,25,129,29],[128,3,128,8],[128,9,128,10],[128,11,128,15],[128,17,128,22],[128,23,128,24],[128,25,128,29],[133,3,133,8],[133,9,133,10],[133,11,133,15],[133,17,133,22],[133,23,133,24],[133,25,133,29],[132,3,132,8],[132,9,132,10],[132,11,132,15],[132,17,132,22],[132,23,132,24],[132,25,132,29],[131,3,131,8],[131,9,131,10],[131,11,131,15],[131,17,131,22],[131,23,131,24],[131,25,131,29],[136,3,136,8],[136,9,136,10],[136,11,136,15],[136,17,136,22],[136,23,136,24],[136,25,136,29],[135,3,135,8],[135,9,135,10],[135,11,135,15],[135,17,135,22],[135,23,135,24],[135,25,135,29],[134,3,134,8],[134,9,134,10],[134,11,134,15],[134,17,134,22],[134,23,134,24],[134,25,134,29],[139,3,139,8],[139,9,139,10],[139,11,139,15],[139,17,139,22],[139,23,139,24],[139,25,139,29],[138,3,138,8],[138,9,138,10],[138,11,138,15],[138,17,138,22],[138,23,138,24],[138,25,138,29],[137,3,137,8],[137,9,137,10],[137,11,137,15],[137,17,137,22],[137,23,137,24],[137,25,137,29],[142,3,142,8],[142,9,142,10],[142,11,142,15],[142,17,142,22],[142,23,142,24],[142,25,142,29],[141,3,141,8],[141,9,141,10],[141,11,141,15],[141,17,141,22],[141,23,141,24],[141,25,141,29],[140,3,140,8],[140,9,140,10],[140,11,140,15],[140,17,140,22],[140,23,140,24],[140,25,140,29],[145,3,145,8],[145,9,145,10],[145,11,145,15],[145,17,145,22],[145,23,145,24],[145,25,145,29],[144,3,144,8],[144,9,144,10],[144,11,144,15],[144,17,144,22],[144,23,144,24],[144,25,144,29],[143,3,143,8],[143,9,143,10],[143,11,143,15],[143,17,143,22],[143,23,143,24],[143,25,143,29],[148,3,148,8],[148,9,148,10],[148,11,148,15],[148,17,148,22],[148,23,148,24],[148,25,148,29],[147,3,147,8],[147,9,147,10],[147,11,147,15],[147,17,147,22],[147,23,147,24],[147,25,147,29],[146,3,146,8],[146,9,146,10],[146,11,146,15],[146,17,146,22],[146,23,146,24],[146,25,146,29],[151,3,151,8],[151,9,151,10],[151,11,151,15],[151,17,151,22],[151,23,151,24],[151,25,151,29],[150,3,150,8],[150,9,150,10],[150,11,150,15],[150,17,150,22],[150,23,150,24],[150,25,150,29],[149,3,149,8],[149,9,149,10],[149,11,149,15],[149,17,149,22],[149,23,149,24],[149,25,149,29],[154,3,154,8],[154,9,154,10],[154,11,154,15],[154,17,154,22],[154,23,154,24],[154,25,154,29],[153,3,153,8],[153,9,153,10],[153,11,153,15],[153,17,153,22],[153,23,153,24],[153,25,153,29],[152,3,152,8],[152,9,152,10],[152,11,152,15],[152,17,152,22],[152,23,152,24],[152,25,152,29],[157,3,157,8],[157,9,157,10],[157,11,157,15],[157,17,157,22],[157,23,157,24],[157,25,157,29],[156,3,156,8],[156,9,156,10],[156,11,156,15],[156,17,156,22],[156,23,156,24],[156,25,156,29],[155,3,155,8],[155,9,155,10],[155,11,155,15],[155,17,155,22],[155,23,155,24],[155,25,155,29],[160,3,160,8],[160,9,160,10],[160,11,160,15],[160,17,160,22],[160,23,160,24],[160,25,160,29],[159,3,159,8],[159,9,159,10],[159,11,159,15],[159,17,159,22],[159,23,159,24],[159,25,159,29],[158,3,158,8],[158,9,158,10],[158,11,158,15],[158,17,158,22],[158,23,158,24],[158,25,158,29],[163,3,163,8],[163,9,163,10],[163,11,163,15],[163,17,163,22],[163,23,163,24],[163,25,163,29],[162,3,162,8],[162,9,162,10],[162,11,162,15],[162,17,162,22],[162,23,162,24],[162,25,162,29],[161,3,161,8],[161,9,161,10],[161,11,161,15],[161,17,161,22],[161,23,161,24],[161,25,161,29],[166,3,166,8],[166,9,166,10],[166,11,166,15],[166,17,166,22],[166,23,166,24],[166,25,166,29],[165,3,165,8],[165,9,165,10],[165,11,165,15],[165,17,165,22],[165,23,165,24],[165,25,165,29],[164,3,164,8],[164,9,164,10],[164,11,164,15],[164,17,164,22],[164,23,164,24],[164,25,164,29],[169,3,169,8],[169,9,169,10],[169,11,169,15],[169,17,169,22],[169,23,169,24],[169,25,169,29],[168,3,168,8],[168,9,168,10],[168,11,168,15],[168,17,168,22],[168,23,168,24],[168,25,168,29],[167,3,167,8],[167,9,167,10],[167,11,167,15],[167,17,167,22],[167,23,167,24],[167,25,167,29],[172,3,172,8],[172,9,172,10],[172,11,172,15],[172,17,172,22],[172,23,172,24],[172,25,172,29],[171,3,171,8],[171,9,171,10],[171,11,171,15],[171,17,171,22],[171,23,171,24],[171,25,171,29],[170,3,170,8],[170,9,170,10],[170,11,170,15],[170,17,170,22],[170,23,170,24],[170,25,170,29],[175,3,175,8],[175,9,175,10],[175,11,175,15],[175,17,175,22],[175,23,175,24],[175,25,175,29],[174,3,174,8],[174,9,174,10],[174,11,174,15],[174,17,174,22],[174,23,174,24],[174,25,174,29],[173,3,173,8],[173,9,173,10],[173,11,173,15],[173,17,173,22],[173,23,173,24],[173,25,173,29],[178,3,178,8],[178,9,178,10],[178,11,178,15],[178,17,178,22],[178,23,178,24],[178,25,178,29],[177,3,177,8],[177,9,177,10],[177,11,177,15],[177,17,177,22],[177,23,177,24],[177,25,177,29],[176,3,176,8],[176,9,176,10],[176,11,176,15],[176,17,176,22],[176,23,176,24],[176,25,176,29],[181,3,181,8]],"merged_total":1665,"flags":["merged_cut"]}
[null,"CENSO NACIONAL DE GOBIERNOS\nESTATALES 2023"]
[]
[null,"Módulo 7.\nCatastro, registro y territorio"]
[]
[null,"Sección II. Registro Público de la Propiedad"]
[]
[null,"Complemento 2"]
[]
[null,"Entidad:",null,null,null,null,null,null,null,null,null,null,null,"Clave:",null,null,null,null,null,null,null,null,null,null,null,null,"Índice"]
[null,{"$f":"IF(Presentación!B10=\"\",\"\",Presentación!B10)","v":"Veracruz de Ignacio de la Llave"},null,null,null,null,null,null,null,null,null,null,null,{"$f":"Presentación!N10","v":"30"}]
[]
[null,null,"Esta tabla corresponde a la pregunta 2.7 \"Nombre de la oficina y municipios que fueron atendidos en su jurisdicción\"."]
[]
[null,null,"Municipios/demarcaciones territoriales atendidos por oficinas en las cabeceras regionales"]
[null,null,"No","Nombre de la oficina en la cabecera regional",null,null,null,null,null,"Clave",null,"Municipio/\ndemarcación territorial",null,null,null,null,"No","Nombre de la oficina en la cabecera regional",null,null,null,null,null,"Clave",null,"Municipio/\ndemarcación territorial"]
[null,null,"21.",null,null,null,null,null,null,{"$f":"IF(ISBLANK(L16),\"\",VLOOKUP(L16,INDIRECT(CONCATENATE(\"LC_\",RIGHT($N$10,2))),2,FALSE))","v":""},null,null,null,null,null,null,"296.",null,null,null,null,null,null,{"$f":"IF(ISBLANK(Z16),\"\",VLOOKUP(Z16,INDIRECT(CONCATENATE(\"LC_\",RIGHT($N$10,2))),2,FALSE))","v":""}]
[null,null,"22.",null,null,null,null,null,null,{"$f":"IF(ISBLANK(L17),\"\",VLOOKUP(L17,INDIRECT(CONCATENATE(\"LC_\",RIGHT($N$10,2))),2,FALSE))","v":""},null,null,null,null,null,null,"297.",null,null,null,null,null,null,{"$f":"IF(ISBLANK(Z17),\"\",VLOOKUP(Z17,INDIRECT(CONCATENATE(\"LC_\",RIGHT($N$10,2))),2,FALSE))","v":""}]
[null,null,"23.",null,null,null,null,null,null,"",null,null,null,null,null,null,"298.",null,null,null,null,null,null,""]
[null,null,"24.",null,null,null,null,null,null,"",null,null,null,null,null,null,"299.",null,null,null,null,null,null,""]
[null,null,"25.",null,null,null,null,null,null,"",null,null,null,null,null,null,"300.",null,null,null,null,null,null,""]
[null,null,"26.",null,null,null,null,null,null,{"$f":"IF(ISBLANK(L21),\"\",VLOOKUP(L21,INDIRECT(CONCATENATE(\"LC_\",RIGHT($N$10,2))),2,FALSE))","v":""},null,null,null,null,null,null,"301.",null,null,null,null,null,null,""]
[null,null,"27.",null,null,null,null,null,null,"",null,null,null,null,null,null,"302.",null,null,null,null,null,null,""]
[null,null,"28.",null,null,null,null,null,null,"",null,null,null,null,null,null,"303.",null,null,null,null,null,null,""]
[null,null,"29.",null,null,null,null,null,null,"",null,null,null,null,null,null,"304.",null,null,null,null,null,null,""]
[null,null,"30.",null,null,null,null,null,null,"",null,null,null,null,null,null,"305.",null,null,null,null,null,null,""]
[null,null,"31.",null,null,null,null,null,null,"",null,null,null,null,null,null,"306.",null,null,null,null,null,null,""]
[null,null,"32.",null,null,null,null,null,null,"",null,null,null,null,null,null,"307.",null,null,null,null,null,null,""]
[null,null,"33.",null,null,null,null,null,null,"",null,null,null,null,null,null,"308.",null,null,null,null,null,null,""]
[null,null,"34.",null,null,null,null,null,null,"",null,null,null,null,null,null,"309.",null,null,null,null,null,null,""]
[null,null,"35.",null,null,null,null,null,null,"",null,null,null,null,null,null,"310.",null,null,null,null,null,null,""]
[null,null,"36.",null,null,null,null,null,null,"",null,null,null,null,null,null,"311.",null,null,null,null,null,null,""]
[null,null,"37.",null,null,null,null,null,null,"",null,null,null,null,null,null,"312.",null,null,null,null,null,null,""]
[null,null,"38.",null,null,null,null,null,null,"",null,null,null,null,null,null,"313.",null,null,null,null,null,null,""]
[null,null,"39.",null,null,null,null,null,null,"",null,null,null,null,null,null,"314.",null,null,null,null,null,null,""]
[null,null,"40.",null,null,null,null,null,null,"",null,null,null,null,null,null,"315.",null,null,null,null,null,null,""]
[null,null,"41.",null,null,null,null,null,null,"",null,null,null,null,null,null,"316.",null,null,null,null,null,null,""]
[null,null,"42.",null,null,null,null,null,null,"",null,null,null,null,null,null,"317.",null,null,null,null,null,null,""]
[null,null,"43.",null,null,null,null,null,null,"",null,null,null,null,null,null,"318.",null,null,null,null,null,null,""]
[null,null,"44.",null,null,null,null,null,null,"",null,null,null,null,null,null,"319.",null,null,null,null,null,null,""]
[null,null,"45.",null,null,null,null,null,null,"",null,null,null,null,null,null,"320.",null,null,null,null,null,null,""]
[null,null,"46.",null,null,null,null,null,null,"",null,null,null,null,null,null,"321.",null,null,null,null,null,null,""]
[null,null,"47.",null,null,null,null,null,null,"",null,null,null,null,null,null,"322.",null,null,null,null,null,null,""]
[null,null,"48.",null,null,null,null,null,null,"",null,null,null,null,null,null,"323.",null,null,null,null,null,null,""]
[null,null,"49.",null,null,null,null,null,null,"",null,null,null,null,null,null,"324.",null,null,null,null,null,null,""]
[null,null,"50.",null,null,null,null,null,null,"",null,null,null,null,null,null,"325.",null,null,null,null,null,null,""]
[null,null,"51.",null,null,null,null,null,null,"",null,null,null,null,null,null,"326.",null,null,null,null,null,null,""]
[null,null,"52",null,null,null,null,null,null,"",null,null,null,null,null,null,"327.",null,null,null,null,null,null,""]
[null,null,"53.",null,null,null,null,null,null,"",null,null,null,null,null,null,"328.",null,null,null,null,null,null,""]
[null,null,"54.",null,null,null,null,null,null,"",null,null,null,null,null,null,"329.",null,null,null,null,null,null,""]
[null,null,"55.",null,null,null,null,null,null,"",null,null,null,null,null,null,"330.",null,null,null,null,null,null,""]
[null,null,"56.",null,null,null,null,null,null,"",null,null,null,null,null,null,"331.",null,null,null,null,null,null,""]
[null,null,"57.",null,null,null,null,null,null,"",null,null,null,null,null,null,"332.",null,null,null,null,null,null,""]
[null,null,"58.",null,null,null,null,null,null,"",null,null,null,null,null,null,"333.",null,null,null,null,null,null,""]
[null,null,"59.",null,null,null,null,null,null,"",null,null,null,null,null,null,"334.",null,null,null,null,null,null,""]
[null,null,"60.",null,null,null,null,null,null,"",null,null,null,null,null,null,"335.",null,null,null,null,null,null,""]
[null,null,"61.",null,null,null,null,null,null,"",null,null,null,null,null,null,"336.",null,null,null,null,null,null,""]
[null,null,"62.",null,null,null,null,null,null,"",null,null,null,null,null,null,"337.",null,null,null,null,null,null,""]
[null,null,"63.",null,null,null,null,null,null,"",null,null,null,null,null,null,"338.",null,null,null,null,null,null,""]
[null,null,"64.",null,null,null,null,null,null,"",null,null,null,null,null,null,"339.",null,null,null,null,null,null,""]
[null,null,"65.",null,null,null,null,null,null,"",null,null,null,null,null,null,"340.",null,null,null,null,null,null,""]
[null,null,"66.",null,null,null,null,null,null,"",null,null,null,null,null,null,"341.",null,null,null,null,null,null,""]
[null,null,"67.",null,null,null,null,null,null,"",null,null,null,null,null,null,"342.",null,null,null,null,null,null,""]
[null,null,"68.",null,null,null,null,null,null,"",null,null,null,null,null,null,"343.",null,null,null,null,null,null,""]
[null,null,"69.",null,null,null,null,null,null,"",null,null,null,null,null,null,"344.",null,null,null,null,null,null,""]
[null,null,"70.",null,null,null,null,null,null,"",null,null,null,null,null,null,"345.",null,null,null,null,null,null,""]
[null,null,"71.",null,null,null,null,null,null,"",null,null,null,null,null,null,"346.",null,null,null,null,null,null,""]
[null,null,"72.",null,null,null,null,null,null,"",null,null,null,null,null,null,"347.",null,null,null,null,null,null,""]
[null,null,"73.",null,null,null,null,null,null,"",null,null,null,null,null,null,"348.",null,null,null,null,null,null,""]
[null,null,"74.",null,null,null,null,null,null,"",null,null,null,null,null,null,"349.",null,null,null,null,null,null,""]
[null,null,"75.",null,null,null,null,null,null,"",null,null,null,null,null,null,"350.",null,null,null,null,null,null,""]
[null,null,"76.",null,null,null,null,null,null,"",null,null,null,null,null,null,"351.",null,null,null,null,null,null,""]
[null,null,"77.",null,null,null,null,null,null,"",null,null,null,null,null,null,"352.",null,null,null,null,null,null,""]
[null,null,"78.",null,null,null,null,null,null,"",null,null,null,null,null,null,"353.",null,null,null,null,null,null,""]
[null,null,"79.",null,null,null,null,null,null,"",null,null,null,null,null,null,"354.",null,null,null,null,null,null,""]
[null,null,"80.",null,null,null,null,null,null,"",null,null,null,null,null,null,"355.",null,null,null,null,null,null,""]
[null,null,"81.",null,null,null,null,null,null,"",null,null,null,null,null,null,"356.",null,null,null,null,null,null,""]
[null,null,"82.",null,null,null,null,null,null,"",null,null,null,null,null,null,"357.",null,null,null,null,null,null,""]
[null,null,"83.",null,null,null,null,null,null,"",null,null,null,null,null,null,"358.",null,null,null,null,null,null,""]
[null,null,"84.",null,null,null,null,null,null,"",null,null,null,null,null,null,"359.",null,null,null,null,null,null,""]
[null,null,"85.",null,null,null,null,null,null,"",null,null,null,null,null,null,"360.",null,null,null,null,null,null,""]
[null,null,"86.",null,null,null,null,null,null,{"$f":"IF(ISBLANK(L81),\"\",VLOOKUP(L81,INDIRECT(CONCATENATE(\"LC_\",RIGHT($N$10,2))),2,FALSE))","v":""},null,null,null,null,null,null,"361.",null,null,null,null,null,null,{"$f":"IF(ISBLANK(Z81),\"\",VLOOKUP(Z81,INDIRECT(CONCATENATE(\"LC_\",RIGHT($N$10,2))),2,FALSE))","v":""}]
[null,null,"87.",null,null,null,null,null,null,"",null,null,null,null,null,null,"362.",null,null,null,null,null,null,""]
[null,null,"88.",null,null,null,null,null,null,"",null,null,null,null,null,null,"363.",null,null,null,null,null,null,""]
[null,null,"89.",null,null,null,null,null,null,"",null,null,null,null,null,null,"364.",null,null,null,null,null,null,""]
[null,null,"90.",null,null,null,null,null,null,"",null,null,null,null,null,null,"365.",null,null,null,null,null,null,""]
[null,null,"91.",null,null,null,null,null,null,"",null,null,null,null,null,null,"366.",null,null,null,null,null,null,""]
[null,null,"92.",null,null,null,null,null,null,"",null,null,null,null,null,null,"367.",null,null,null,null,null,null,""]
[null,null,"93.",null,null,null,null,null,null,"",null,null,null,null,null,null,"368.",null,null,null,null,null,null,""]
[null,null,"94.",null,null,null,null,null,null,"",null,null,null,null,null,null,"369.",null,null,null,null,null,null,""]
[null,null,"95.",null,null,null,null,null,null,"",null,null,null,null,null,null,"370.",null,null,null,null,null,null,""]
[null,null,"96.",null,null,null,null,null,null,"",null,null,null,null,null,null,"371.",null,null,null,null,null,null,""]
[null,null,"97.",null,null,null,null,null,null,"",null,null,null,null,null,null,"372.",null,null,null,null,null,null,""]
[null,null,"98.",null,null,null,null,null,null,"",null,null,null,null,null,null,"373.",null,null,null,null,null,null,""]
[null,null,"99.",null,null,null,null,null,null,"",null,null,null,null,null,null,"374.",null,null,null,null,null,null,""]
[null,null,"100.",null,null,null,null,null,null,"",null,null,null,null,null,null,"375.",null,null,null,null,null,null,""]
[null,null,"101.",null,null,null,null,null,null,"",null,null,null,null,null,null,"376.",null,null,null,null,null,null,""]
[null,null,"102.",null,null,null,null,null,null,"",null,null,null,null,null,null,"377.",null,null,null,null,null,null,""]
[null,null,"103.",null,null,null,null,null,null,"",null,null,null,null,null,null,"378.",null,null,null,null,null,null,""]
[null,null,"104.",null,null,null,null,null,null,"",null,null,null,null,null,null,"379.",null,null,null,null,null,null,""]
[null,null,"105.",null,null,null,null,null,null,"",null,null,null,null,null,null,"380.",null,null,null,null,null,null,""]
[null,null,"106.",null,null,null,null,null,null,"",null,null,null,null,null,null,"381.",null,null,null,null,null,null,""]
[null,null,"107.",null,null,null,null,null,null,"",null,null,null,null,null,null,"382.",null,null,null,null,null,null,""]
[null,null,"108.",null,null,null,null,null,null,"",null,null,null,null,null,null,"383.",null,null,null,null,null,null,""]
[null,null,"109.",null,null,null,null,null,null,"",null,null,null,null,null,null,"384.",null,null,null,null,null,null,""]
[null,null,"110.",null,null,null,null,null,null,"",null,null,null,null,null,null,"385.",null,null,null,null,null,null,""]
[null,null,"111.",null,null,null,null,null,null,"",null,null,null,null,null,null,"386.",null,null,null,null,null,null,""]
[null,null,"112.",null,null,null,null,null,null,"",null,null,null,null,null,null,"387.",null,null,null,null,null,null,""]
[null,null,"113.",null,null,null,null,null,null,"",null,null,null,null,null,null,"388.",null,null,null,null,null,null,""]
[null,null,"114.",null,null,null,null,null,null,"",null,null,null,null,null,null,"389.",null,null,null,null,null,null,""]
[null,null,"115.",null,null,null,null,null,null,"",null,null,null,null,null,null,"390.",null,null,null,null,null,null,""]
[null,null,"116.",null,null,null,null,null,null,"",null,null,null,null,null,null,"391.",null,null,null,null,null,null,""]
[null,null,"117.",null,null,null,null,null,null,"",null,null,null,null,null,null,"392.",null,null,null,null,null,null,""]
[null,null,"118.",null,null,null,null,null,null,"",null,null,null,null,null,null,"393.",null,null,null,null,null,null,""]
[null,null,"119.",null,null,null,null,null,null,"",null,null,null,null,null,null,"394.",null,null,null,null,null,null,""]
[null,null,"120.",null,null,null,null,null,null,"",null,null,null,null,null,null,"395.",null,null,null,null,null,null,""]
[null,null,"121.",null,null,null,null,null,null,"",null,null,null,null,null,null,"396.",null,null,null,null,null,null,""]
[null,null,"122.",null,null,null,null,null,null,"",null,null,null,null,null,null,"397.",null,null,null,null,null,null,""]
[null,null,"123.",null,null,null,null,null,null,"",null,null,null,null,null,null,"398.",null,null,null,null,null,null,""]
[null,null,"124.",null,null,null,null,null,null,"",null,null,null,null,null,null,"399.",null,null,null,null,null,null,""]
[null,null,"125.",null,null,null,null,null,null,"",null,null,null,null,null,null,"400.",null,null,null,null,null,null,""]
[null,null,"126.",null,null,null,null,null,null,"",null,null,null,null,null,null,"401.",null,null,null,null,null,null,""]
[null,null,"127.",null,null,null,null,null,null,"",null,null,null,null,null,null,"402.",null,null,null,null,null,null,""]
[null,null,"128.",null,null,null,null,null,null,"",null,null,null,null,null,null,"403.",null,null,null,null,null,null,""]
[null,null,"129.",null,null,null,null,null,null,"",null,null,null,null,null,null,"404.",null,null,null,null,null,null,""]
[null,null,"130.",null,null,null,null,null,null,"",null,null,null,null,null,null,"405.",null,null,null,null,null,null,""]
[null,null,"131.",null,null,null,null,null,null,"",null,null,null,null,null,null,"406.",null,null,null,null,null,null,""]
[null,null,"132.",null,null,null,null,null,null,"",null,null,null,null,null,null,"407.",null,null,null,null,null,null,""]
[null,null,"133.",null,null,null,null,null,null,"",null,null,null,null,null,null,"408.",null,null,null,null,null,null,""]
[null,null,"134.",null,null,null,null,null,null,"",null,null,null,null,null,null,"409.",null,null,null,null,null,null,""]
[null,null,"135.",null,null,null,null,null,null,"",null,null,null,null,null,null,"410.",null,null,null,null,null,null,""]
[null,null,"136.",null,null,null,null,null,null,"",null,null,null,null,null,null,"411.",null,null,null,null,null,null,""]
[null,null,"137.",null,null,null,null,null,null,"",null,null,null,null,null,null,"412.",null,null,null,null,null,null,""]
[null,null,"138.",null,null,null,null,null,null,"",null,null,null,null,null,null,"413.",null,null,null,null,null,null,""]
[null,null,"139.",null,null,null,null,null,null,"",null,null,null,null,null,null,"414.",null,null,null,null,null,null,""]
[null,null,"140.",null,null,null,null,null,null,"",null,null,null,null,null,null,"415.",null,null,null,null,null,null,""]
[null,null,"141.",null,null,null,null,null,null,"",null,null,null,null,null,null,"416.",null,null,null,null,null,null,""]
[null,null,"142.",null,null,null,null,null,null,"",null,null,null,null,null,null,"417.",null,null,null,null,null,null,""]
[null,null,"143.",null,null,null,null,null,null,"",null,null,null,null,null,null,"418.",null,null,null,null,null,null,""]
[null,null,"144.",null,null,null,null,null,null,"",null,null,null,null,null,null,"419.",null,null,null,null,null,null,""]
[null,null,"145.",null,null,null,null,null,null,"",null,null,null,null,null,null,"420.",null,null,null,null,null,null,""]
[null,null,"146.",null,null,null,null,null,null,"",null,null,null,null,null,null,"421.",null,null,null,null,null,null,""]
[null,null,"147.",null,null,null,null,null,null,"",null,null,null,null,null,null,"422.",null,null,null,null,null,null,""]
[null,null,"148.",null,null,null,null,null,null,"",null,null,null,null,null,null,"423.",null,null,null,null,null,null,""]
[null,null,"149.",null,null,null,null,null,null,"",null,null,null,null,null,null,"424.",null,null,null,null,null,null,""]
[null,null,"150.",null,null,null,null,null,null,{"$f":"IF(ISBLANK(L145),\"\",VLOOKUP(L145,INDIRECT(CONCATENATE(\"LC_\",RIGHT($N$10,2))),2,FALSE))","v":""},null,null,null,null,null,null,"425.",null,null,null,null,null,null,{"$f":"IF(ISBLANK(Z145),\"\",VLOOKUP(Z145,INDIRECT(CONCATENATE(\"LC_\",RIGHT($N$10,2))),2,FALSE))","v":""}]
[null,null,"151.",null,null,null,null,null,null,"",null,null,null,null,null,null,"426.",null,null,null,null,null,null,""]
[null,null,"152.",null,null,null,null,null,null,"",null,null,null,null,null,null,"427.",null,null,null,null,null,null,""]
[null,null,"153.",null,null,null,null,null,null,"",null,null,null,null,null,null,"428.",null,null,null,null,null,null,""]
[null,null,"154.",null,null,null,null,null,null,"",null,null,null,null,null,null,"429.",null,null,null,null,null,null,""]
[null,null,"155.",null,null,null,null,null,null,"",null,null,null,null,null,null,"430.",null,null,null,null,null,null,""]
[null,null,"156.",null,null,null,null,null,null,"",null,null,null,null,null,null,"431.",null,null,null,null,null,null,""]
[null,null,"157.",null,null,null,null,null,null,"",null,null,null,null,null,null,"432.",null,null,null,null,null,null,""]
[null,null,"158.",null,null,null,null,null,null,"",null,null,null,null,null,null,"433.",null,null,null,null,null,null,""]
[null,null,"159.",null,null,null,null,null,null,"",null,null,null,null,null,null,"434.",null,null,null,null,null,null,""]
[null,null,"160.",null,null,null,null,null,null,"",null,null,null,null,null,null,"435.",null,null,null,null,null,null,""]
[null,null,"161.",null,null,null,null,null,null,"",null,null,null,null,null,null,"436.",null,null,null,null,null,null,""]
[null,null,"162.",null,null,null,null,null,null,"",null,null,null,null,null,null,"437.",null,null,null,null,null,null,""]
[null,null,"163.",null,null,null,null,null,null,"",null,null,null,null,null,null,"438.",null,null,null,null,null,null,""]
[null,null,"164.",null,null,null,null,null,null,"",null,null,null,null,null,null,"439.",null,null,null,null,null,null,""]
[null,null,"165.",null,null,null,null,null,null,"",null,null,null,null,null,null,"440.",null,null,null,null,null,null,""]
[null,null,"166.",null,null,null,null,null,null,"",null,null,null,null,null,null,"441.",null,null,null,null,null,null,""]
[null,null,"167.",null,null,null,null,null,null,"",null,null,null,null,null,null,"442.",null,null,null,null,null,null,""]
[null,null,"168.",null,null,null,null,null,null,"",null,null,null,null,null,null,"443.",null,null,null,null,null,null,""]
[null,null,"169.",null,null,null,null,null,null,"",null,null,null,null,null,null,"444.",null,null,null,null,null,null,""]
[null,null,"170.",null,null,null,null,null,null,"",null,null,null,null,null,null,"445.",null,null,null,null,null,null,""]
[null,null,"171.",null,null,null,null,null,null,"",null,null,null,null,null,null,"446.",null,null,null,null,null,null,""]
[null,null,"172.",null,null,null,null,null,null,"",null,null,null,null,null,null,"447.",null,null,null,null,null,null,""]
[null,null,"173.",null,null,null,null,null,null,"",null,null,null,null,null,null,"448.",null,null,null,null,null,null,"",null,null,null,null,null,null,null,null,0]
[null,null,"174.",null,null,null,null,null,null,"",null,null,null,null,null,null,"449.",null,null,null,null,null,null,""]
[null,null,"175.",null,null,null,null,null,null,"",null,null,null,null,null,null,"450.",null,null,null,null,null,null,""]
[null,null,"176.",null,null,null,null,null,null,"",null,null,null,null,null,null,"451.",null,null,null,null,null,null,""]
[null,null,"177.",null,null,null,null,null,null,"",null,null,null,null,null,null,"452.",null,null,null,null,null,null,""]
[null,null,"178.",null,null,null,null,null,null,"",null,null,null,null,null,null,"453.",null,null,null,null,null,null,""]
[null,null,"179.",null,null,null,null,null,null,"",null,null,null,null,null,null,"454.",null,null,null,null,null,null,""]
[null,null,"180.",null,null,null,null,null,null,"",null,null,null,null,null,null,"455.",null,null,null,null,null,null,""]
[null,null,"181.",null,null,null,null,null,null,"",null,null,null,null,null,null,"456.",null,null,null,null,null,null,""]
[null,null,"182.",null,null,null,null,null,null,"",null,null,null,null,null,null,"457.",null,null,null,null,null,null,""]
[null,null,"183.",null,null,null,null,null,null,"",null,null,null,null,null,null,"458.",null,null,null,null,null,null,""]
[null,null,"184.",null,null,null,null,null,null,"",null,null,null,null,null,null,"459.",null,null,null,null,null,null,""]
[null,null,"185.",null,null,null,null,null,null,"",null,null,null,null,null,null,"460.",null,null,null,null,null,null,""]
[null,null,"186.",null,null,null,null,null,null,"",null,null,null,null,null,null,"461.",null,null,null,null,null,null,""]
[null,null,"187.",null,null,null,null,null,null,"",null,null,null,null,null,null,"462.",null,null,null,null,null,null,""]
[null,null,"188.",null,null,null,null,null,null,"",null,null,null,null,null,null,"463.",null,null,null,null,null,null,""]
[null,null,"189.",null,null,null,null,null,null,"",null,null,null,null,null,null,"464.",null,null,null,null,null,null,""]
[null,null,"190.",null,null,null,null,null,null,"",null,null,null,null,null,null,"465.",null,null,null,null,null,null,""]
[null,null,"191.",null,null,null,null,null,null,"",null,null,null,null,null,null,"466.",null,null,null,null,null,null,""]
[null,null,"192.",null,null,null,null,null,null,"",null,null,null,null,null,null,"467.",null,null,null,null,null,null,""]
[null,null,"193.",null,null,null,null,null,null,"",null,null,null,null,null,null,"468.",null,null,null,null,null,null,""]
[null,null,"194.",null,null,null,null,null,null,"",null,null,null,null,null,null,"469.",null,null,null,null,null,null,""]
[null,null,"195.",null,null,null,null,null,null,"",null,null,null,null,null,null,"470.",null,null,null,null,null,null,""]
[null,null,"196.",null,null,null,null,null,null,"",null,null,null,null,null,null,"471.",null,null,null,null,null,null,""]
[null,null,"197.",null,null,null,null,null,null,"",null,null,null,null,null,null,"472.",null,null,null,null,null,null,""]
[null,null,"198.",null,null,null,null,null,null,"",null,null,null,null,null,null,"473.",null,null,null,null,null,null,""]
[null,null,"199.",null,null,null,null,null,null,"",null,null,null,null,null,null,"474.",null,null,null,null,null,null,""]
[null,null,"200.",null,null,null,null,null,null,"",null,null,null,null,null,null,"475.",null,null,null,null,null,null,""]
[null,null,"201.",null,null,null,null,null,null,"",null,null,null,null,null,null,"476.",null,null,null,null,null,null,""]
[null,null,"202.",null,null,null,null,null,null,"",null,null,null,null,null,null,"477.",null,null,null,null,null,null,""]
[null,null,"203.",null,null,null,null,null,null,"",null,null,null,null,null,null,"478.",null,null,null,null,null,null,""]
[null,null,"204.",null,null,null,null,null,null,"",null,null,null,null,null,null,"479.",null,null,null,null,null,null,""]
[null,null,"205.",null,null,null,null,null,null,"",null,null,null,null,null,null,"480.",null,null,null,null,null,null,""]
[null,null,"206.",null,null,null,null,null,null,"",null,null,null,null,null,null,"481.",null,null,null,null,null,null,""]
[null,null,"207.",null,null,null,null,null,null,"",null,null,null,null,null,null,"482.",null,null,null,null,null,null,""]
[null,null,"208.",null,null,null,null,null,null,"",null,null,null,null,null,null,"483.",null,null,null,null,null,null,""]
[null,null,"209.",null,null,null,null,null,null,"",null,null,null,null,null,null,"484.",null,null,null,null,null,null,""]
[null,null,"210.",null,null,null,null,null,null,"",null,null,null,null,null,null,"485.",null,null,null,null,null,null,""]
[null,null,"211.",null,null,null,null,null,null,"",null,null,null,null,null,null,"486.",null,null,null,null,null,null,""]
[null,null,"212.",null,null,null,null,null,null,"",null,null,null,null,null,null,"487.",null,null,null,null,null,null,""]
[null,null,"213.",null,null,null,null,null,null,"",null,null,null,null,null,null,"488.",null,null,null,null,null,null,""]
[null,null,"214.",null,null,null,null,null,null,{"$f":"IF(ISBLANK(L209),\"\",VLOOKUP(L209,INDIRECT(CONCATENATE(\"LC_\",RIGHT($N$10,2))),2,FALSE))","v":""},null,null,null,null,null,null,"489.",null,null,null,null,null,null,{"$f":"IF(ISBLANK(Z209),\"\",VLOOKUP(Z209,INDIRECT(CONCATENATE(\"LC_\",RIGHT($N$10,2))),2,FALSE))","v":""}]
[null,null,"215.",null,null,null,null,null,null,"",null,null,null,null,null,null,"490.",null,null,null,null,null,null,""]
[null,null,"216.",null,null,null,null,null,null,"",null,null,null,null,null,null,"491.",null,null,null,null,null,null,""]
[null,null,"217.",null,null,null,null,null,null,"",null,null,null,null,null,null,"492.",null,null,null,null,null,null,""]
[null,null,"218.",null,null,null,null,null,null,"",null,null,null,null,null,null,"493.",null,null,null,null,null,null,""]
[null,null,"219.",null,null,null,null,null,null,"",null,null,null,null,null,null,"494.",null,null,null,null,null,null,""]
[null,null,"220.",null,null,null,null,null,null,"",null,null,null,null,null,null,"495.",null,null,null,null,null,null,""]
[null,null,"221.",null,null,null,null,null,null,"",null,null,null,null,null,null,"496.",null,null,null,null,null,null,""]
[null,null,"222.",null,null,null,null,null,null,"",null,null,null,null,null,null,"497.",null,null,null,null,null,null,""]
[null,null,"223.",null,null,null,null,null,null,"",null,null,null,null,null,null,"498.",null,null,null,null,null,null,""]
[null,null,"224.",null,null,null,null,null,null,"",null,null,null,null,null,null,"499.",null,null,null,null,null,null,""]
[null,null,"225.",null,null,null,null,null,null,"",null,null,null,null,null,null,"500.",null,null,null,null,null,null,""]
[null,null,"226.",null,null,null,null,null,null,"",null,null,null,null,null,null,"501.",null,null,null,null,null,null,""]
[null,null,"227.",null,null,null,null,null,null,"",null,null,null,null,null,null,"502.",null,null,null,null,null,null,""]
[null,null,"228.",null,null,null,null,null,null,"",null,null,null,null,null,null,"503.",null,null,null,null,null,null,""]
[null,null,"229.",null,null,null,null,null,null,"",null,null,null,null,null,null,"504.",null,null,null,null,null,null,""]
[null,null,"230.",null,null,null,null,null,null,"",null,null,null,null,null,null,"505.",null,null,null,null,null,null,""]
[null,null,"231.",null,null,null,null,null,null,"",null,null,null,null,null,null,"506.",null,null,null,null,null,null,""]
[null,null,"232.",null,null,null,null,null,null,"",null,null,null,null,null,null,"507.",null,null,null,null,null,null,""]
[null,null,"233.",null,null,null,null,null,null,"",null,null,null,null,null,null,"508.",null,null,null,null,null,null,""]
[null,null,"234.",null,null,null,null,null,null,"",null,null,null,null,null,null,"509.",null,null,null,null,null,null,""]
[null,null,"235.",null,null,null,null,null,null,"",null,null,null,null,null,null,"510.",null,null,null,null,null,null,""]
[null,null,"236.",null,null,null,null,null,null,"",null,null,null,null,null,null,"511.",null,null,null,null,null,null,""]
[null,null,"237.",null,null,null,null,null,null,"",null,null,null,null,null,null,"512.",null,null,null,null,null,null,""]
[null,null,"238.",null,null,null,null,null,null,"",null,null,null,null,null,null,"513.",null,null,null,null,null,null,""]
[null,null,"239.",null,null,null,null,null,null,"",null,null,null,null,null,null,"514.",null,null,null,null,null,null,""]
[null,null,"240.",null,null,null,null,null,null,"",null,null,null,null,null,null,"515.",null,null,null,null,null,null,""]
[null,null,"241.",null,null,null,null,null,null,"",null,null,null,null,null,null,"516.",null,null,null,null,null,null,""]
[null,null,"242.",null,null,null,null,null,null,"",null,null,null,null,null,null,"517.",null,null,null,null,null,null,""]
[null,null,"243.",null,null,null,null,null,null,"",null,null,null,null,null,null,"518.",null,null,null,null,null,null,""]
[null,null,"244.",null,null,null,null,null,null,"",null,null,null,null,null,null,"519.",null,null,null,null,null,null,""]
[null,null,"245.",null,null,null,null,null,null,"",null,null,null,null,null,null,"520.",null,null,null,null,null,null,""]
[null,null,"246.",null,null,null,null,null,null,"",null,null,null,null,null,null,"521.",null,null,null,null,null,null,""]
[null,null,"247.",null,null,null,null,null,null,"",null,null,null,null,null,null,"522.",null,null,null,null,null,null,""]
[null,null,"248.",null,null,null,null,null,null,"",null,null,null,null,null,null,"523.",null,null,null,null,null,null,""]
[null,null,"249.",null,null,null,null,null,null,"",null,null,null,null,null,null,"524.",null,null,null,null,null,null,""]
[null,null,"250.",null,null,null,null,null,null,"",null,null,null,null,null,null,"525.",null,null,null,null,null,null,""]
[null,null,"251.",null,null,null,null,null,null,"",null,null,null,null,null,null,"526.",null,null,null,null,null,null,""]
[null,null,"252.",null,null,null,null,null,null,"",null,null,null,null,null,null,"527.",null,null,null,null,null,null,""]
[null,null,"253.",null,null,null,null,null,null,"",null,null,null,null,null,null,"528.",null,null,null,null,null,null,""]
[null,null,"254.",null,null,null,null,null,null,"",null,null,null,null,null,null,"529.",null,null,null,null,null,null,""]
[null,null,"255.",null,null,null,null,null,null,"",null,null,null,null,null,null,"530.",null,null,null,null,null,null,""]
[null,null,"256.",null,null,null,null,null,null,"",null,null,null,null,null,null,"531.",null,null,null,null,null,null,""]
[null,null,"257.",null,null,null,null,null,null,"",null,null,null,null,null,null,"532.",null,null,null,null,null,null,""]
[null,null,"258.",null,null,null,null,null,null,"",null,null,null,null,null,null,"533.",null,null,null,null,null,null,""]
[null,null,"259.",null,null,null,null,null,null,"",null,null,null,null,null,null,"534.",null,null,null,null,null,null,""]
[null,null,"260.",null,null,null,null,null,null,"",null,null,null,null,null,null,"535.",null,null,null,null,null,null,""]
[null,null,"261.",null,null,null,null,null,null,"",null,null,null,null,null,null,"536.",null,null,null,null,null,null,""]
[null,null,"262.",null,null,null,null,null,null,"",null,null,null,null,null,null,"537.",null,null,null,null,null,null,""]
[null,null,"263.",null,null,null,null,null,null,"",null,null,null,null,null,null,"538.",null,null,null,null,null,null,""]
[null,null,"264.",null,null,null,null,null,null,"",null,null,null,null,null,null,"539.",null,null,null,null,null,null,""]
[null,null,"265.",null,null,null,null,null,null,"",null,null,null,null,null,null,"540.",null,null,null,null,null,null,""]
[null,null,"266.",null,null,null,null,null,null,"",null,null,null,null,null,null,"541.",null,null,null,null,null,null,""]
[null,null,"267.",null,null,null,null,null,null,"",null,null,null,null,null,null,"542.",null,null,null,null,null,null,""]
[null,null,"268.",null,null,null,null,null,null,"",null,null,null,null,null,null,"543.",null,null,null,null,null,null,""]
[null,null,"269.",null,null,null,null,null,null,"",null,null,null,null,null,null,"544.",null,null,null,null,null,null,""]
[null,null,"270.",null,null,null,null,null,null,"",null,null,null,null,null,null,"545.",null,null,null,null,null,null,""]
[null,null,"271.",null,null,null,null,null,null,"",null,null,null,null,null,null,"546.",null,null,null,null,null,null,""]
[null,null,"272.",null,null,null,null,null,null,"",null,null,null,null,null,null,"547.",null,null,null,null,null,null,""]
[null,null,"273.",null,null,null,null,null,null,"",null,null,null,null,null,null,"548.",null,null,null,null,null,null,""]
[null,null,"274.",null,null,null,null,null,null,"",null,null,null,null,null,null,"549.",null,null,null,null,null,null,""]
[null,null,"275.",null,null,null,null,null,null,"",null,null,null,null,null,null,"550.",null,null,null,null,null,null,""]
[null,null,"276.",null,null,null,null,null,null,"",null,null,null,null,null,null,"551.",null,null,null,null,null,null,""]
[null,null,"277.",null,null,null,null,null,null,"",null,null,null,null,null,null,"552.",null,null,null,null,null,null,""]
[null,null,"278.",null,null,null,null,null,null,{"$f":"IF(ISBLANK(L273),\"\",VLOOKUP(L273,INDIRECT(CONCATENATE(\"LC_\",RIGHT($N$10,2))),2,FALSE))","v":""},null,null,null,null,null,null,"553.",null,null,null,null,null,null,{"$f":"IF(ISBLANK(Z273),\"\",VLOOKUP(Z273,INDIRECT(CONCATENATE(\"LC_\",RIGHT($N$10,2))),2,FALSE))","v":""}]
[null,null,"279.",null,null,null,null,null,null,"",null,null,null,null,null,null,"554.",null,null,null,null,null,null,""]
[null,null,"280.",null,null,null,null,null,null,"",null,null,null,null,null,null,"555.",null,null,null,null,null,null,""]
[null,null,"281.",null,null,null,null,null,null,"",null,null,null,null,null,null,"556.",null,null,null,null,null,null,""]
[null,null,"282.",null,null,null,null,null,null,"",null,null,null,null,null,null,"557.",null,null,null,null,null,null,""]
[null,null,"283.",null,null,null,null,null,null,"",null,null,null,null,null,null,"558.",null,null,null,null,null,null,""]
[null,null,"284.",null,null,null,null,null,null,"",null,null,null,null,null,null,"559.",null,null,null,null,null,null,""]
[null,null,"285.",null,null,null,null,null,null,"",null,null,null,null,null,null,"560.",null,null,null,null,null,null,""]
[null,null,"286.",null,null,null,null,null,null,"",null,null,null,null,null,null,"561.",null,null,null,null,null,null,""]
[null,null,"287.",null,null,null,null,null,null,"",null,null,null,null,null,null,"562.",null,null,null,null,null,null,""]
[null,null,"288.",null,null,null,null,null,null,"",null,null,null,null,null,null,"563.",null,null,null,null,null,null,""]
[null,null,"289.",null,null,null,null,null,null,"",null,null,null,null,null,null,"564.",null,null,null,null,null,null,""]
[null,null,"290.",null,null,null,null,null,null,"",null,null,null,null,null,null,"565.",null,null,null,null,null,null,""]
[null,null,"291.",null,null,null,null,null,null,"",null,null,null,null,null,null,"566.",null,null,null,null,null,null,""]
[null,null,"292.",null,null,null,null,null,null,"",null,null,null,null,null,null,"567.",null,null,null,null,null,null,""]
[null,null,"293.",null,null,null,null,null,null,"",null,null,null,null,null,null,"568.",null,null,null,null,null,null,""]
[null,null,"294.",null,null,null,null,null,null,"",null,null,null,null,null,null,"569.",null,null,null,null,null,null,""]
[null,null,"295.",null,null,null,null,null,null,"",null,null,null,null,null,null,"570.",null,null,null,null,null,null,""]

{"sheet":"Complemento 3","index":9,"n_rows":290,"n_cols":27,"rows_kept":290,"cut":false,"hidden":true,"merged":[[0,1,0,29],[2,1,2,29],[4,1,4,29],[6,1,6,29],[8,26,8,29],[9,1,9,11],[9,13,9,14],[16,3,16,8],[16,9,16,10],[16,11,16,15],[16,17,16,22],[16,23,16,24],[16,25,16,29],[15,3,15,8],[15,9,15,10],[15,11,15,15],[15,17,15,22],[15,23,15,24],[15,25,15,29],[11,2,11,29],[13,2,13,29],[14,3,14,8],[14,9,14,10],[14,11,14,15],[14,17,14,22],[14,23,14,24],[14,25,14,29],[19,3,19,8],[19,9,19,10],[19,11,19,15],[19,17,19,22],[19,23,19,24],[19,25,19,29],[18,3,18,8],[18,9,18,10],[18,11,18,15],[18,17,18,22],[18,23,18,24],[18,25,18,29],[17,3,17,8],[17,9,17,10],[17,11,17,15],[17,17,17,22],[17,23,17,24],[17,25,17,29],[22,3,22,8],[22,9,22,10],[22,11,22,15],[22,17,22,22],[22,23,22,24],[22,25,22,29],[21,3,21,8],[21,9,21,10],[21,11,21,15],[21,17,21,22],[21,23,21,24],[21,25,21,29],[20,3,20,8],[20,9,20,10],[20,11,20,15],[20,17,20,22],[20,23,20,24],[20,25,20,29],[25,3,25,8],[25,9,25,10],[25,11,25,15],[25,17,25,22],[25,23,25,24],[25,25,25,29],[24,3,24,8],[24,9,24,10],[24,11,24,15],[24,17,24,22],[24,23,24,24],[24,25,24,29],[23,3,23,8],[23,9,23,10],[23,11,23,15],[23,17,23,22],[23,23,23,24],[23,25,23,29],[28,3,28,8],[28,9,28,10],[28,11,28,15],[28,17,28,22],[28,23,28,24],[28,25,28,29],[27,3,27,8],[27,9,27,10],[27,11,27,15],[27,17,27,22],[27,23,27,24],[27,25,27,29],[26,3,26,8],[26,9,26,10],[26,11,26,15],[26,17,26,22],[26,23,26,24],[26,25,26,29],[31,3,31,8],[31,9,31,10],[31,11,31,15],[31,17,31,22],[31,23,31,24],[31,25,31,29],[30,3,30,8],[30,9,30,10],[30,11,30,15],[30,17,30,22],[30,23,30,24],[30,25,30,29],[29,3,29,8],[29,9,29,10],[29,11,29,15],[29,17,29,22],[29,23,29,24],[29,25,29,29],[34,3,34,8],[34,9,34,10],[34,11,34,15],[34,17,34,22],[34,23,34,24],[34,25,34,29],[33,3,33,8],[33,9,33,10],[33,11,33,15],[33,17,33,22],[33,23,33,24],[33,25,33,29],[32,3,32,8],[32,9,32,10],[32,11,32,15],[32,17,32,22],[32,23,32,24],[32,25,32,29],[37,3,37,8],[37,9,37,10],[37,11,37,15],[37,17,37,22],[37,23,37,24],[37,25,37,29],[36,3,36,8],[36,9,36,10],[36,11,36,15],[36,17,36,22],[36,23,36,24],[36,25,36,29],[35,3,35,8],[35,9,35,10],[35,11,35,15],[35,17,35,22],[35,23,35,24],[35,25,35,29],[40,3,40,8],[40,9,40,10],[40,11,40,15],[40,17,40,22],[40,23,40,24],[40,25,40,29],[39,3,39,8],[39,9,39,10],[39,11,39,15],[39,17,39,22],[39,23,39,24],[39,25,39,29],[38,3,38,8],[38,9,38,10],[38,11,38,15],[38,17,38,22],[38,23,38,24],[38,25,38,29],[43,3,43,8],[43,9,43,10],[43,11,43,15],[43,17,43,22],[43,23,43,24],[43,25,43,29],[42,3,42,8],[42,9,42,10],[42,11,42,15],[42,17,42,22],[42,23,42,24],[42,25,42,29],[41,3,41,8],[41,9,41,10],[41,11,41,15],[41,17,41,22],[41,23,41,24],[41,25,41,29],[46,3,46,8],[46,9,46,10],[46,11,46,15],[46,17,46,22],[46,23,46,24],[46,25,46,29],[45,3,45,8],[45,9,45,10],[45,11,45,15],[45,17,45,22],[45,23,45,24],[45,25,45,29],[44,3,44,8],[44,9,44,10],[44,11,44,15],[44,17,44,22],[44,23,44,24],[44,25,44,29],[49,3,49,8],[49,9,49,10],[49,11,49,15],[49,17,49,22],[49,23,49,24],[49,25,49,29],[48,3,48,8],[48,9,48,10],[48,11,48,15],[48,17,48,22],[48,23,48,24],[48,25,48,29],[47,3,47,8],[47,9,47,10],[47,11,47,15],[47,17,47,22],[47,23,47,24],[47,25,47,29],[52,3,52,8],[52,9,52,10],[52,11,52,15],[52,17,52,22],[52,23,52,24],[52,25,52,29],[51,3,51,8],[51,9,51,10],[51,11,51,15],[51,17,51,22],[51,23,51,24],[51,25,51,29],[50,3,50,8],[50,9,50,10],[50,11,50,15],[50,17,50,22],[50,23,50,24],[50,25,50,29],[55,3,55,8],[55,9,55,10],[55,11,55,15],[55,17,55,22],[55,23,55,24],[55,25,55,29],[54,3,54,8],[54,9,54,10],[54,11,54,15],[54,17,54,22],[54,23,54,24],[54,25,54,29],[53,3,53,8],[53,9,53,10],[53,11,53,15],[53,17,53,22],[53,23,53,24],[53,25,53,29],[58,3,58,8],[58,9,58,10],[58,11,58,15],[58,17,58,22],[58,23,58,24],[58,25,58,29],[57,3,57,8],[57,9,57,10],[57,11,57,15],[57,17,57,22],[57,23,57,24],[57,25,57,29],[56,3,56,8],[56,9,56,10],[56,11,56,15],[56,17,56,22],[56,23,56,24],[56,25,56,29],[61,3,61,8],[61,9,61,10],[61,11,61,15],[61,17,61,22],[61,23,61,24],[61,25,61,29],[60,3,60,8],[60,9,60,10],[60,11,60,15],[60,17,60,22],[60,23,60,24],[60,25,60,29],[59,3,59,8],[59,9,59,10],[59,11,59,15],[59,17,59,22],[59,23,59,24],[59,25,59,29],[64,3,64,8],[64,9,64,10],[64,11,64,15],[64,17,64,22],[64,23,64,24],[64,25,64,29],[63,3,63,8],[63,9,63,10],[63,11,63,15],[63,17,63,22],[63,23,63,24],[63,25,63,29],[62,3,62,8],[62,9,62,10],[62,11,62,15],[62,17,62,22],[62,23,62,24],[62,25,62,29],[67,3,67,8],[67,9,67,10],[67,11,67,15],[67,17,67,22],[67,23,67,24],[67,25,67,29],[66,3,66,8],[66,9,66,10],[66,11,66,15],[66,17,66,22],[66,23,66,24],[66,25,66,29],[65,3,65,8],[65,9,65,10],[65,11,65,15],[65,17,65,22],[65,23,65,24],[65,25,65,29],[70,3,70,8],[70,9,70,10],[70,11,70,15],[70,17,70,22],[70,23,70,24],[70,25,70,29],[69,3,69,8],[69,9,69,10],[69,11,69,15],[69,17,69,22],[69,23,69,24],[69,25,69,29],[68,3,68,8],[68,9,68,10],[68,11,68,15],[68,17,68,22],[68,23,68,24],[68,25,68,29],[73,3,73,8],[73,9,73,10],[73,11,73,15],[73,17,73,22],[73,23,73,24],[73,25,73,29],[72,3,72,8],[72,9,72,10],[72,11,72,15],[72,17,72,22],[72,23,72,24],[72,25,72,29],[71,3,71,8],[71,9,71,10],[71,11,71,15],[71,17,71,22],[71,23,71,24],[71,25,71,29],[76,3,76,8],[76,9,76,10],[76,11,76,15],[76,17,76,22],[76,23,76,24],[76,25,76,29],[75,3,75,8],[75,9,75,10],[75,11,75,15],[75,17,75,22],[75,23,75,24],[75,25,75,29],[74,3,74,8],[74,9,74,10],[74,11,74,15],[74,17,74,22],[74,23,74,24],[74,25,74,29],[79,3,79,8],[79,9,79,10],[79,11,79,15],[79,17,79,22],[79,23,79,24],[79,25,79,29],[78,3,78,8],[78,9,78,10],[78,11,78,15],[78,17,78,22],[78,23,78,24],[78,25,78,29],[77,3,77,8],[77,9,77,10],[77,11,77,15],[77,17,77,22],[77,23,77,24],[77,25,77,29],[82,3,82,8],[82,9,82,10],[82,11,82,15],[82,17,82,22],[82,23,82,24],[82,25,82,29],[81,3,81,8],[81,9,81,10],[81,11,81,15],[81,17,81,22],[81,23,81,24],[81,25,81,29],[80,3,80,8],[80,9,80,10],[80,11,80,15],[80,17,80,22],[80,23,80,24],[80,25,80,29],[85,3,85,8],[85,9,85,10],[85,11,85,15],[85,17,85,22],[85,23,85,24],[85,25,85,29],[84,3,84,8],[84,9,84,10],[84,11,84,15],[84,17,84,22],[84,23,84,24],[84,25,84,29],[83,3,83,8],[83,9,83,10],[83,11,83,15],[83,17,83,22],[83,23,83,24],[83,25,83,29],[88,3,88,8],[88,9,88,10],[88,11,88,15],[88,17,88,22],[88,23,88,24],[88,25,88,29],[87,3,87,8],[87,9,87,10],[87,11,87,15],[87,17,87,22],[87,23,87,24],[87,25,87,29],[86,3,86,8],[86,9,86,10],[86,11,86,15],[86,17,86,22],[86,23,86,24],[86,25,86,29],[91,3,91,8],[91,9,91,10],[91,11,91,15],[91,17,91,22],[91,23,91,24],[91,25,91,29],[90,3,90,8],[90,9,90,10],[90,11,90,15],[90,17,90,22],[90,23,90,24],[90,25,90,29],[89,3,89,8],[89,9,89,10],[89,11,89,15],[89,17,89,22],[89,23,89,24],[89,25,89,29],[94,3,94,8],[94,9,94,10],[94,11,94,15],[94,17,94,22],[94,23,94,24],[94,25,94,29],[93,3,93,8],[93,9,93,10],[93,11,93,15],[93,17,93,22],[93,23,93,24],[93,25,93,29],[92,3,92,8],[92,9,92,10],[92,11,92,15],[92,17,92,22],[92,23,92,24],[92,25,92,29],[97,3,97,8],[97,9,97,10],[97,11,97,15],[97,17,97,22],[97,23,97,24],[97,25,97,29],[96,3,96,8],[96,9,96,10],[96,11,96,15],[96,17,96,22],[96,23,96,24],[96,25,96,29],[95,3,95,8],[95,9,95,10],[95,11,95,15],[95,17,95,22],[95,23,95,24],[95,25,95,29],[100,3,100,8],[100,9,100,10],[100,11,100,15],[100,17,100,22],[100,23,100,24],[100,25,100,29],[99,3,99,8],[99,9,99,10],[99,11,99,15],[99,17,99,22],[99,23,99,24],[99,25,99,29],[98,3,98,8],[98,9,98,10],[98,11,98,15],[98,17,98,22],[98,23,98,24],[98,25,98,29],[103,3,103,8],[103,9,103,10],[103,11,103,15],[103,17,103,22],[103,23,103,24],[103,25,103,29],[102,3,102,8],[102,9,102,10],[102,11,102,15],[102,17,102,22],[102,23,102,24],[102,25,102,29],[101,3,101,8],[101,9,101,10],[101,11,101,15],[101,17,101,22],[101,23,101,24],[101,25,101,29],[106,3,106,8],[106,9,106,10],[106,11,106,15],[106,17,106,22],[106,23,106,24],[106,25,106,29],[105,3,105,8],[105,9,105,10],[105,11,105,15],[105,17,105,22],[105,23,105,24],[105,25,105,29],[104,3,104,8],[104,9,104,10],[104,11,104,15],[104,17,104,22],[104,23,104,24],[104,25,104,29],[109,3,109,8],[109,9,109,10],[109,11,109,15],[109,17,109,22],[109,23,109,24],[109,25,109,29],[108,3,108,8],[108,9,108,10],[108,11,108,15],[108,17,108,22],[108,23,108,24],[108,25,108,29],[107,3,107,8],[107,9,107,10],[107,11,107,15],[107,17,107,22],[107,23,107,24],[107,25,107,29],[112,3,112,8],[112,9,112,10],[112,11,112,15],[112,17,112,22],[112,23,112,24],[112,25,112,29],[111,3,111,8],[111,9,111,10],[111,11,111,15],[111,17,111,22],[111,23,111,24],[111,25,111,29],[110,3,110,8],[110,9,110,10],[110,11,110,15],[110,17,110,22],[110,23,110,24],[110,25,110,29],[115,3,115,8],[115,9,115,10],[115,11,115,15],[115,17,115,22],[115,23,115,24],[115,25,115,29],[114,3,114,8],[114,9,114,10],[114,11,114,15],[114,17,114,22],[114,23,114,24],[114,25,114,29],[113,3,113,8],[113,9,113,10],[113,11,113,15],[113,17,113,22],[113,23,113,24],[113,25,113,29],[118,3,118,8],[118,9,118,10],[118,11,118,15],[118,17,118,22],[118,23,118,24],[118,25,118,29],[117,3,117,8],[117,9,117,10],[117,11,117,15],[117,17,117,22],[117,23,117,24],[117,25,117,29],[116,3,116,8],[116,9,116,10],[116,11,116,15],[116,17,116,22],[116,23,116,24],[116,25,116,29],[121,3,121,8],[121,9,121,10],[121,11,121,15],[121,17,121,22],[121,23,121,24],[121,25,121,29],[120,3,120,8],[120,9,120,10],[120,11,120,15],[120,17,120,22],[120,23,120,24],[120,25,120,29],[119,3,119,8],[119,9,119,10],[119,11,119,15],[119,17,119,22],[119,23,119,24],[119,25,119,29],[124,3,124,8],[124,9,124,10],[124,11,124,15],[124,17,124,22],[124,23,124,24],[124,25,124,29],[123,3,123,8],[123,9,123,10],[123,11,123,15],[123,17,123,22],[123,23,123,24],[123,25,123,29],[122,3,122,8],[122,9,122,10],[122,11,122,15],[122,17,122,22],[122,23,122,24],[122,25,122,29],[127,3,127,8],[127,9,127,10],[127,11,127,15],[127,17,127,22],[127,23,127,24],[127,25,127,29],[126,3,126,8],[126,9,126,10],[126,11,126,15],[126,17,126,22],[126,23,126,24],[126,25,126,29],[125,3,125,8],[125,9,125,10],[125,11,125,15],[125,17,125,22],[125,23,125,24],[125,25,125,29],[130,3,130,8],[130,9,130,10],[130,11,130,15],[130,17,130,22],[130,23,130,24],[130,25,130,29],[129,3,129,8],[129,9,129,10],[129,11,129,15],[129,17,129,22],[129,23,129,24],[129,25,129,29],[128,3,128,8],[128,9,128,10],[128,11,128,15],[128,17,128,22],[128,23,128,24],[128,25,128,29],[133,3,133,8],[133,9,133,10],[133,11,133,15],[133,17,133,22],[133,23,133,24],[133,25,133,29],[132,3,132,8],[132,9,132,10],[132,11,132,15],[132,17,132,22],[132,23,132,24],[132,25,132,29],[131,3,131,8],[131,9,131,10],[131,11,131,15],[131,17,131,22],[131,23,131,24],[131,25,131,29],[136,3,136,8],[136,9,136,10],[136,11,136,15],[136,17,136,22],[136,23,136,24],[136,25,136,29],[135,3,135,8],[135,9,135,10],[135,11,135,15],[135,17,135,22],[135,23,135,24],[135,25,135,29],[134,3,134,8],[134,9,134,10],[134,11,134,15],[134,17,134,22],[134,23,134,24],[134,25,134,29],[139,3,139,8],[139,9,139,10],[139,11,139,15],[139,17,139,22],[139,23,139,24],[139,25,139,29],[138,3,138,8],[138,9,138,10],[138,11,138,15],[138,17,138,22],[138,23,138,24],[138,25,138,29],[137,3,137,8],[137,9,137,10],[137,11,137,15],[137,17,137,22],[137,23,137,24],[137,25,137,29],[142,3,142,8],[142,9,142,10],[142,11,142,15],[142,17,142,22],[142,23,142,24],[142,25,142,29],[141,3,141,8],[141,9,141,10],[141,11,141,15],[141,17,141,22],[141,23,141,24],[141,25,141,29],[140,3,140,8],[140,9,140,10],[140,11,140,15],[140,17,140,22],[140,23,140,24],[140,25,140,29],[145,3,145,8],[145,9,145,10],[145,11,145,15],[145,17,145,22],[145,23,145,24],[145,25,145,29],[144,3,144,8],[144,9,144,10],[144,11,144,15],[144,17,144,22],[144,23,144,24],[144,25,144,29],[143,3,143,8],[143,9,143,10],[143,11,143,15],[143,17,143,22],[143,23,143,24],[143,25,143,29],[148,3,148,8],[148,9,148,10],[148,11,148,15],[148,17,148,22],[148,23,148,24],[148,25,148,29],[147,3,147,8],[147,9,147,10],[147,11,147,15],[147,17,147,22],[147,23,147,24],[147,25,147,29],[146,3,146,8],[146,9,146,10],[146,11,146,15],[146,17,146,22],[146,23,146,24],[146,25,146,29],[151,3,151,8],[151,9,151,10],[151,11,151,15],[151,17,151,22],[151,23,151,24],[151,25,151,29],[150,3,150,8],[150,9,150,10],[150,11,150,15],[150,17,150,22],[150,23,150,24],[150,25,150,29],[149,3,149,8],[149,9,149,10],[149,11,149,15],[149,17,149,22],[149,23,149,24],[149,25,149,29],[154,3,154,8],[154,9,154,10],[154,11,154,15],[154,17,154,22],[154,23,154,24],[154,25,154,29],[153,3,153,8],[153,9,153,10],[153,11,153,15],[153,17,153,22],[153,23,153,24],[153,25,153,29],[152,3,152,8],[152,9,152,10],[152,11,152,15],[152,17,152,22],[152,23,152,24],[152,25,152,29],[157,3,157,8],[157,9,157,10],[157,11,157,15],[157,17,157,22],[157,23,157,24],[157,25,157,29],[156,3,156,8],[156,9,156,10],[156,11,156,15],[156,17,156,22],[156,23,156,24],[156,25,156,29],[155,3,155,8],[155,9,155,10],[155,11,155,15],[155,17,155,22],[155,23,155,24],[155,25,155,29],[160,3,160,8],[160,9,160,10],[160,11,160,15],[160,17,160,22],[160,23,160,24],[160,25,160,29],[159,3,159,8],[159,9,159,10],[159,11,159,15],[159,17,159,22],[159,23,159,24],[159,25,159,29],[158,3,158,8],[158,9,158,10],[158,11,158,15],[158,17,158,22],[158,23,158,24],[158,25,158,29],[163,3,163,8],[163,9,163,10],[163,11,163,15],[163,17,163,22],[163,23,163,24],[163,25,163,29],[162,3,162,8],[162,9,162,10],[162,11,162,15],[162,17,162,22],[162,23,162,24],[162,25,162,29],[161,3,161,8],[161,9,161,10],[161,11,161,15],[161,17,161,22],[161,23,161,24],[161,25,161,29],[166,3,166,8],[166,9,166,10],[166,11,166,15],[166,17,166,22],[166,23,166,24],[166,25,166,29],[165,3,165,8],[165,9,165,10],[165,11,165,15],[165,17,165,22],[165,23,165,24],[165,25,165,29],[164,3,164,8],[164,9,164,10],[164,11,164,15],[164,17,164,22],[164,23,164,24],[164,25,164,29],[169,3,169,8],[169,9,169,10],[169,11,169,15],[169,17,169,22],[169,23,169,24],[169,25,169,29],[168,3,168,8],[168,9,168,10],[168,11,168,15],[168,17,168,22],[168,23,168,24],[168,25,168,29],[167,3,167,8],[167,9,167,10],[167,11,167,15],[167,17,167,22],[167,23,167,24],[167,25,167,29],[172,3,172,8],[172,9,172,10],[172,11,172,15],[172,17,172,22],[172,23,172,24],[172,25,172,29],[171,3,171,8],[171,9,171,10],[171,11,171,15],[171,17,171,22],[171,23,171,24],[171,25,171,29],[170,3,170,8],[170,9,170,10],[170,11,170,15],[170,17,170,22],[170,23,170,24],[170,25,170,29],[175,3,175,8],[175,9,175,10],[175,11,175,15],[175,17,175,22],[175,23,175,24],[175,25,175,29],[174,3,174,8],[174,9,174,10],[174,11,174,15],[174,17,174,22],[174,23,174,24],[174,25,174,29],[173,3,173,8],[173,9,173,10],[173,11,173,15],[173,17,173,22],[173,23,173,24],[173,25,173,29],[178,3,178,8],[178,9,178,10],[178,11,178,15],[178,17,178,22],[178,23,178,24],[178,25,178,29],[177,3,177,8],[177,9,177,10],[177,11,177,15],[177,17,177,22],[177,23,177,24],[177,25,177,29],[176,3,176,8],[176,9,176,10],[176,11,176,15],[176,17,176,22],[176,23,176,24],[176,25,176,29],[181,3,181,8]],"merged_total":1665,"flags":["merged_cut"]}
[null,"CENSO NACIONAL DE GOBIERNOS\nESTATALES 2023"]
[]
[null,"Módulo 7.\nCatastro, registro y territorio"]
[]
[null,"Sección II. Registro Público de la Propiedad"]
[]
[null,"Complemento 3"]
[]
[null,"Entidad:",null,null,null,null,null,null,null,null,null,null,null,"Clave:",null,null,null,null,null,null,null,null,null,null,null,null,"Índice"]
[null,{"$f":"IF(Presentación!B10=\"\",\"\",Presentación!B10)","v":"Veracruz de Ignacio de la Llave"},null,null,null,null,null,null,null,null,null,null,null,{"$f":"Presentación!N10","v":"30"}]
[]
[null,null,"Esta tabla corresponde a la pregunta 2.7 \"Nombre de la oficina y municipios que fueron atendidos en su jurisdicción\"."]
[]
[null,null,"Municipios/demarcaciones territoriales atendidos por oficinas en las cabeceras de distritos judiciales"]
[null,null,"No","Nombre de la oficina en la cabecera de distrito judicial",null,null,null,null,null,"Clave",null,"Municipio/\ndemarcación territorial",null,null,null,null,"No","Nombre de la oficina en la cabecera de distrito judicial",null,null,null,null,null,"Clave",null,"Municipio/\ndemarcación territorial"]
[null,null,"21.",null,null,null,null,null,null,{"$f":"IF(ISBLANK(L16),\"\",VLOOKUP(L16,INDIRECT(CONCATENATE(\"LC_\",RIGHT($N$10,2))),2,FALSE))","v":""},null,null,null,null,null,null,"296.",null,null,null,null,null,null,{"$f":"IF(ISBLANK(Z16),\"\",VLOOKUP(Z16,INDIRECT(CONCATENATE(\"LC_\",RIGHT($N$10,2))),2,FALSE))","v":""}]
[null,null,"22.",null,null,null,null,null,null,{"$f":"IF(ISBLANK(L17),\"\",VLOOKUP(L17,INDIRECT(CONCATENATE(\"LC_\",RIGHT($N$10,2))),2,FALSE))","v":""},null,null,null,null,null,null,"297.",null,null,null,null,null,null,{"$f":"IF(ISBLANK(Z17),\"\",VLOOKUP(Z17,INDIRECT(CONCATENATE(\"LC_\",RIGHT($N$10,2))),2,FALSE))","v":""}]
[null,null,"23.",null,null,null,null,null,null,"",null,null,null,null,null,null,"298.",null,null,null,null,null,null,""]
[null,null,"24.",null,null,null,null,null,null,"",null,null,null,null,null,null,"299.",null,null,null,null,null,null,""]
[null,null,"25.",null,null,null,null,null,null,"",null,null,null,null,null,null,"300.",null,null,null,null,null,null,""]
[null,null,"26.",null,null,null,null,null,null,"",null,null,null,null,null,null,"301.",null,null,null,null,null,null,""]
[null,null,"27.",null,null,null,null,null,null,"",null,null,null,null,null,null,"302.",null,null,null,null,null,null,""]
[null,null,"28.",null,null,null,null,null,null,"",null,null,null,null,null,null,"303.",null,null,null,null,null,null,""]
[null,null,"29.",null,null,null,null,null,null,"",null,null,null,null,null,null,"304.",null,null,null,null,null,null,""]
[null,null,"30.",null,null,null,null,null,null,"",null,null,null,null,null,null,"305.",null,null,null,null,null,null,""]
[null,null,"31.",null,null,null,null,null,null,"",null,null,null,null,null,null,"306.",null,null,null,null,null,null,""]
[null,null,"32.",null,null,null,null,null,null,"",null,null,null,null,null,null,"307.",null,null,null,null,null,null,""]
[null,null,"33.",null,null,null,null,null,null,"",null,null,null,null,null,null,"308.",null,null,null,null,null,null,""]
[null,null,"34.",null,null,null,null,null,null,"",null,null,null,null,null,null,"309.",null,null,null,null,null,null,""]
[null,null,"35.",null,null,null,null,null,null,"",null,null,null,null,null,null,"310.",null,null,null,null,null,null,""]
[null,null,"36.",null,null,null,null,null,null,"",null,null,null,null,null,null,"311.",null,null,null,null,null,null,""]
[null,null,"37.",null,null,null,null,null,null,"",null,null,null,null,null,null,"312.",null,null,null,null,null,null,""]
[null,null,"38.",null,null,null,null,null,null,"",null,null,null,null,null,null,"313.",null,null,null,null,null,null,""]
[null,null,"39.",null,null,null,null,null,null,"",null,null,null,null,null,null,"314.",null,null,null,null,null,null,""]
[null,null,"40.",null,null,null,null,null,null,"",null,null,null,null,null,null,"315.",null,null,null,null,null,null,""]
[null,null,"41.",null,null,null,null,null,null,"",null,null,null,null,null,null,"316.",null,null,null,null,null,null,""]
[null,null,"42.",null,null,null,null,null,null,"",null,null,null,null,null,null,"317.",null,null,null,null,null,null,""]
[null,null,"43.",null,null,null,null,null,null,"",null,null,null,null,null,null,"318.",null,null,null,null,null,null,""]
[null,null,"44.",null,null,null,null,null,null,"",null,null,null,null,null,null,"319.",null,null,null,null,null,null,""]
[null,null,"45.",null,null,null,null,null,null,"",null,null,null,null,null,null,"320.",null,null,null,null,null,null,""]
[null,null,"46.",null,null,null,null,null,null,"",null,null,null,null,null,null,"321.",null,null,null,null,null,null,""]
[null,null,"47.",null,null,null,null,null,null,"",null,null,null,null,null,null,"322.",null,null,null,null,null,null,""]
[null,null,"48.",null,null,null,null,null,null,"",null,null,null,null,null,null,"323.",null,null,null,null,null,null,""]
[null,null,"49.",null,null,null,null,null,null,"",null,null,null,null,null,null,"324.",null,null,null,null,null,null,""]
[null,null,"50.",null,null,null,null,null,null,"",null,null,null,null,null,null,"325.",null,null,null,null,null,null,""]
[null,null,"51.",null,null,null,null,null,null,"",null,null,null,null,null,null,"326.",null,null,null,null,null,null,""]
[null,null,"52",null,null,null,null,null,null,"",null,null,null,null,null,null,"327.",null,null,null,null,null,null,""]
[null,null,"53.",null,null,null,null,null,null,"",null,null,null,null,null,null,"328.",null,null,null,null,null,null,""]
[null,null,"54.",null,null,null,null,null,null,"",null,null,null,null,null,null,"329.",null,null,null,null,null,null,""]
[null,null,"55.",null,null,null,null,null,null,"",null,null,null,null,null,null,"330.",null,null,null,null,null,null,""]
[null,null,"56.",null,null,null,null,null,null,"",null,null,null,null,null,null,"331.",null,null,null,null,null,null,""]
[null,null,"57.",null,null,null,null,null,null,"",null,null,null,null,null,null,"332.",null,null,null,null,null,null,""]
[null,null,"58.",null,null,null,null,null,null,"",null,null,null,null,null,null,"333.",null,null,null,null,null,null,""]
[null,null,"59.",null,null,null,null,null,null,"",null,null,null,null,null,null,"334.",null,null,null,null,null,null,""]
[null,null,"60.",null,null,null,null,null,null,"",null,null,null,null,null,null,"335.",null,null,null,null,null,null,""]
[null,null,"61.",null,null,null,null,null,null,"",null,null,null,null,null,null,"336.",null,null,null,null,null,null,""]
[null,null,"62.",null,null,null,null,null,null,"",null,null,null,null,null,null,"337.",null,null,null,null,null,null,""]
[null,null,"63.",null,null,null,null,null,null,"",null,null,null,null,null,null,"338.",null,null,null,null,null,null,""]
[null,null,"64.",null,null,null,null,null,null,"",null,null,null,null,null,null,"339.",null,null,null,null,null,null,""]
[null,null,"65.",null,null,null,null,null,null,"",null,null,null,null,null,null,"340.",null,null,null,null,null,null,""]
[null,null,"66.",null,null,null,null,null,null,"",null,null,null,null,null,null,"341.",null,null,null,null,null,null,""]
[null,null,"67.",null,null,null,null,null,null,"",null,null,null,null,null,null,"342.",null,null,null,null,null,null,""]
[null,null,"68.",null,null,null,null,null,null,"",null,null,null,null,null,null,"343.",null,null,null,null,null,null,""]
[null,null,"69.",null,null,null,null,null,null,"",null,null,null,null,null,null,"344.",null,null,null,null,null,null,""]
[null,null,"70.",null,null,null,null,null,null,"",null,null,null,null,null,null,"345.",null,null,null,null,null,null,""]
[null,null,"71.",null,null,null,null,null,null,"",null,null,null,null,null,null,"346.",null,null,null,null,null,null,""]
[null,null,"72.",null,null,null,null,null,null,"",null,null,null,null,null,null,"347.",null,null,null,null,null,null,""]
[null,null,"73.",null,null,null,null,null,null,"",null,null,null,null,null,null,"348.",null,null,null,null,null,null,""]
[null,null,"74.",null,null,null,null,null,null,"",null,null,null,null,null,null,"349.",null,null,null,null,null,null,""]
[null,null,"75.",null,null,null,null,null,null,"",null,null,null,null,null,null,"350.",null,null,null,null,null,null,""]
[null,null,"76.",null,null,null,null,null,null,"",null,null,null,null,null,null,"351.",null,null,null,null,null,null,""]
[null,null,"77.",null,null,null,null,null,null,"",null,null,null,null,null,null,"352.",null,null,null,null,null,null,""]
[null,null,"78.",null,null,null,null,null,null,"",null,null,null,null,null,null,"353.",null,null,null,null,null,null,""]
[null,null,"79.",null,null,null,null,null,null,"",null,null,null,null,null,null,"354.",null,null,null,null,null,null,""]
[null,null,"80.",null,null,null,null,null,null,"",null,null,null,null,null,null,"355.",null,null,null,null,null,null,""]
[null,null,"81.",null,null,null,null,null,null,"",null,null,null,null,null,null,"356.",null,null,null,null,null,null,""]
[null,null,"82.",null,null,null,null,null,null,"",null,null,null,null,null,null,"357.",null,null,null,null,null,null,""]
[null,null,"83.",null,null,null,null,null,null,"",null,null,null,null,null,null,"358.",null,null,null,null,null,null,""]
[null,null,"84.",null,null,null,null,null,null,"",null,null,null,null,null,null,"359.",null,null,null,null,null,null,""]
[null,null,"85.",null,null,null,null,null,null,"",null,null,null,null,null,null,"360.",null,null,null,null,null,null,""]
[null,null,"86.",null,null,null,null,null,null,{"$f":"IF(ISBLANK(L81),\"\",VLOOKUP(L81,INDIRECT(CONCATENATE(\"LC_\",RIGHT($N$10,2))),2,FALSE))","v":""},null,null,null,null,null,null,"361.",null,null,null,null,null,null,{"$f":"IF(ISBLANK(Z81),\"\",VLOOKUP(Z81,INDIRECT(CONCATENATE(\"LC_\",RIGHT($N$10,2))),2,FALSE))","v":""}]
[null,null,"87.",null,null,null,null,null,null,"",null,null,null,null,null,null,"362.",null,null,null,null,null,null,""]
[null,null,"88.",null,null,null,null,null,null,"",null,null,null,null,null,null,"363.",null,null,null,null,null,null,""]
[null,null,"89.",null,null,null,null,null,null,"",null,null,null,null,null,null,"364.",null,null,null,null,null,null,""]
[null,null,"90.",null,null,null,null,null,null,"",null,null,null,null,null,null,"365.",null,null,null,null,null,null,""]
[null,null,"91.",null,null,null,null,null,null,"",null,null,null,null,null,null,"366.",null,null,null,null,null,null,""]
[null,null,"92.",null,null,null,null,null,null,"",null,null,null,null,null,null,"367.",null,null,null,null,null,null,""]
[null,null,"93.",null,null,null,null,null,null,"",null,null,null,null,null,null,"368.",null,null,null,null,null,null,""]
[null,null,"94.",null,null,null,null,null,null,"",null,null,null,null,null,null,"369.",null,null,null,null,null,null,""]
[null,null,"95.",null,null,null,null,null,null,"",null,null,null,null,null,null,"370.",null,null,null,null,null,null,""]
[null,null,"96.",null,null,null,null,null,null,"",null,null,null,null,null,null,"371.",null,null,null,null,null,null,""]
[null,null,"97.",null,null,null,null,null,null,"",null,null,null,null,null,null,"372.",null,null,null,null,null,null,""]
[null,null,"98.",null,null,null,null,null,null,"",null,null,null,null,null,null,"373.",null,null,null,null,null,null,""]
[null,null,"99.",null,null,null,null,null,null,"",null,null,null,null,null,null,"374.",null,null,null,null,null,null,""]
[null,null,"100.",null,null,null,null,null,null,"",null,null,null,null,null,null,"375.",null,null,null,null,null,null,""]
[null,null,"101.",null,null,null,null,null,null,"",null,null,null,null,null,null,"376.",null,null,null,null,null,null,""]
[null,null,"102.",null,null,null,null,null,null,"",null,null,null,null,null,null,"377.",null,null,null,null,null,null,""]
[null,null,"103.",null,null,null,null,null,null,"",null,null,null,null,null,null,"378.",null,null,null,null,null,null,""]
[null,null,"104.",null,null,null,null,null,null,"",null,null,null,null,null,null,"379.",null,null,null,null,null,null,""]
[null,null,"105.",null,null,null,null,null,null,"",null,null,null,null,null,null,"380.",null,null,null,null,null,null,""]
[null,null,"106.",null,null,null,null,null,null,"",null,null,null,null,null,null,"381.",null,null,null,null,null,null,""]
[null,null,"107.",null,null,null,null,null,null,"",null,null,null,null,null,null,"382.",null,null,null,null,null,null,""]
[null,null,"108.",null,null,null,null,null,null,"",null,null,null,null,null,null,"383.",null,null,null,null,null,null,""]
[null,null,"109.",null,null,null,null,null,null,"",null,null,null,null,null,null,"384.",null,null,null,null,null,null,""]
[null,null,"110.",null,null,null,null,null,null,"",null,null,null,null,null,null,"385.",null,null,null,null,null,null,""]
[null,null,"111.",null,null,null,null,null,null,"",null,null,null,null,null,null,"386.",null,null,null,null,null,null,""]
[null,null,"112.",null,null,null,null,null,null,"",null,null,null,null,null,null,"387.",null,null,null,null,null,null,""]
[null,null,"113.",null,null,null,null,null,null,"",null,null,null,null,null,null,"388.",null,null,null,null,null,null,""]
[null,null,"114.",null,null,null,null,null,null,"",null,null,null,null,null,null,"389.",null,null,null,null,null,null,""]
[null,null,"115.",null,null,null,null,null,null,"",null,null,null,null,null,null,"390.",null,null,null,null,null,null,""]
[null,null,"116.",null,null,null,null,null,null,"",null,null,null,null,null,null,"391.",null,null,null,null,null,null,""]
[null,null,"117.",null,null,null,null,null,null,"",null,null,null,null,null,null,"392.",null,null,null,null,null,null,""]
[null,null,"118.",null,null,null,null,null,null,"",null,null,null,null,null,null,"393.",null,null,null,null,null,null,""]
[null,null,"119.",null,null,null,null,null,null,"",null,null,null,null,null,null,"394.",null,null,null,null,null,null,""]
[null,null,"120.",null,null,null,null,null,null,"",null,null,null,null,null,null,"395.",null,null,null,null,null,null,""]
[null,null,"121.",null,null,null,null,null,null,"",null,null,null,null,null,null,"396.",null,null,null,null,null,null,""]
[null,null,"122.",null,null,null,null,null,null,"",null,null,null,null,null,null,"397.",null,null,null,null,null,null,""]
[null,null,"123.",null,null,null,null,null,null,"",null,null,null,null,null,null,"398.",null,null,null,null,null,null,""]
[null,null,"124.",null,null,null,null,null,null,"",null,null,null,null,null,null,"399.",null,null,null,null,null,null,""]
[null,null,"125.",null,null,null,null,null,null,"",null,null,null,null,null,null,"400.",null,null,null,null,null,null,""]
[null,null,"126.",null,null,null,null,null,null,"",null,null,null,null,null,null,"401.",null,null,null,null,null,null,""]
[null,null,"127.",null,null,null,null,null,null,"",null,null,null,null,null,null,"402.",null,null,null,null,null,null,""]
[null,null,"128.",null,null,null,null,null,null,"",null,null,null,null,null,null,"403.",null,null,null,null,null,null,""]
[null,null,"129.",null,null,null,null,null,null,"",null,null,null,null,null,null,"404.",null,null,null,null,null,null,""]
[null,null,"130.",null,null,null,null,null,null,"",null,null,null,null,null,null,"405.",null,null,null,null,null,null,""]
[null,null,"131.",null,null,null,null,null,null,"",null,null,null,null,null,null,"406.",null,null,null,null,null,null,""]
[null,null,"132.",null,null,null,null,null,null,"",null,null,null,null,null,null,"407.",null,null,null,null,null,null,""]
[null,null,"133.",null,null,null,null,null,null,"",null,null,null,null,null,null,"408.",null,null,null,null,null,null,""]
[null,null,"134.",null,null,null,null,null,null,"",null,null,null,null,null,null,"409.",null,null,null,null,null,null,""]
[null,null,"135.",null,null,null,null,null,null,"",null,null,null,null,null,null,"410.",null,null,null,null,null,null,""]
[null,null,"136.",null,null,null,null,null,null,"",null,null,null,null,null,null,"411.",null,null,null,null,null,null,""]
[null,null,"137.",null,null,null,null,null,null,"",null,null,null,null,null,null,"412.",null,null,null,null,null,null,""]
[null,null,"138.",null,null,null,null,null,null,"",null,null,null,null,null,null,"413.",null,null,null,null,null,null,""]
[null,null,"139.",null,null,null,null,null,null,"",null,null,null,null,null,null,"414.",null,null,null,null,null,null,""]
[null,null,"140.",null,null,null,null,null,null,"",null,null,null,null,null,null,"415.",null,null,null,null,null,null,""]
[null,null,"141.",null,null,null,null,null,null,"",null,null,null,null,null,null,"416.",null,null,null,null,null,null,""]
[null,null,"142.",null,null,null,null,null,null,"",null,null,null,null,null,null,"417.",null,null,null,null,null,null,""]
[null,null,"143.",null,null,null,null,null,null,"",null,null,null,null,null,null,"418.",null,null,null,null,null,null,""]
[null,null,"144.",null,null,null,null,null,null,"",null,null,null,null,null,null,"419.",null,null,null,null,null,null,""]
[null,null,"145.",null,null,null,null,null,null,"",null,null,null,null,null,null,"420.",null,null,null,null,null,null,""]
[null,null,"146.",null,null,null,null,null,null,"",null,null,null,null,null,null,"421.",null,null,null,null,null,null,""]
[null,null,"147.",null,null,null,null,null,null,"",null,null,null,null,null,null,"422.",null,null,null,null,null,null,""]
[null,null,"148.",null,null,null,null,null,null,"",null,null,null,null,null,null,"423.",null,null,null,null,null,null,""]
[null,null,"149.",null,null,null,null,null,null,"",null,null,null,null,null,null,"424.",null,null,null,null,null,null,""]
[null,null,"150.",null,null,null,null,null,null,{"$f":"IF(ISBLANK(L145),\"\",VLOOKUP(L145,INDIRECT(CONCATENATE(\"LC_\",RIGHT($N$10,2))),2,FALSE))","v":""},null,null,null,null,null,null,"425.",null,null,null,null,null,null,{"$f":"IF(ISBLANK(Z145),\"\",VLOOKUP(Z145,INDIRECT(CONCATENATE(\"LC_\",RIGHT($N$10,2))),2,FALSE))","v":""}]
[null,null,"151.",null,null,null,null,null,null,"",null,null,null,null,null,null,"426.",null,null,null,null,null,null,""]
[null,null,"152.",null,null,null,null,null,null,"",null,null,null,null,null,null,"427.",null,null,null,null,null,null,""]
[null,null,"153.",null,null,null,null,null,null,"",null,null,null,null,null,null,"428.",null,null,null,null,null,null,""]
[null,null,"154.",null,null,null,null,null,null,"",null,null,null,null,null,null,"429.",null,null,null,null,null,null,""]
[null,null,"155.",null,null,null,null,null,null,"",null,null,null,null,null,null,"430.",null,null,null,null,null,null,""]
[null,null,"156.",null,null,null,null,null,null,"",null,null,null,null,null,null,"431.",null,null,null,null,null,null,""]
[null,null,"157.",null,null,null,null,null,null,"",null,null,null,null,null,null,"432.",null,null,null,null,null,null,""]
[null,null,"158.",null,null,null,null,null,null,"",null,null,null,null,null,null,"433.",null,null,null,null,null,null,""]
[null,null,"159.",null,null,null,null,null,null,"",null,null,null,null,null,null,"434.",null,null,null,null,null,null,""]
[null,null,"160.",null,null,null,null,null,null,"",null,null,null,null,null,null,"435.",null,null,null,null,null,null,""]
[null,null,"161.",null,null,null,null,null,null,"",null,null,null,null,null,null,"436.",null,null,null,null,null,null,""]
[null,null,"162.",null,null,null,null,null,null,"",null,null,null,null,null,null,"437.",null,null,null,null,null,null,""]
[null,null,"163.",null,null,null,null,null,null,"",null,null,null,null,null,null,"438.",null,null,null,null,null,null,""]
[null,null,"164.",null,null,null,null,null,null,"",null,null,null,null,null,null,"439.",null,null,null,null,null,null,""]
[null,null,"165.",null,null,null,null,null,null,"",null,null,null,null,null,null,"440.",null,null,null,null,null,null,""]
[null,null,"166.",null,null,null,null,null,null,"",null,null,null,null,null,null,"441.",null,null,null,null,null,null,""]
[null,null,"167.",null,null,null,null,null,null,"",null,null,null,null,null,null,"442.",null,null,null,null,null,null,""]
[null,null,"168.",null,null,null,null,null,null,"",null,null,null,null,null,null,"443.",null,null,null,null,null,null,""]
[null,null,"169.",null,null,null,null,null,null,"",null,null,null,null,null,null,"444.",null,null,null,null,null,null,""]
[null,null,"170.",null,null,null,null,null,null,"",null,null,null,null,null,null,"445.",null,null,null,null,null,null,""]
[null,null,"171.",null,null,null,null,null,null,"",null,null,null,null,null,null,"446.",null,null,null,null,null,null,""]
[null,null,"172.",null,null,null,null,null,null,"",null,null,null,null,null,null,"447.",null,null,null,null,null,null,""]
[null,null,"173.",null,null,null,null,null,null,"",null,null,null,null,null,null,"448.",null,null,null,null,null,null,""]
[null,null,"174.",null,null,null,null,null,null,"",null,null,null,null,null,null,"449.",null,null,null,null,null,null,""]
[null,null,"175.",null,null,null,null,null,null,"",null,null,null,null,null,null,"450.",null,null,null,null,null,null,""]
[null,null,"176.",null,null,null,null,null,null,"",null,null,null,null,null,null,"451.",null,null,null,null,null,null,""]
[null,null,"177.",null,null,null,null,null,null,"",null,null,null,null,null,null,"452.",null,null,null,null,null,null,""]
[null,null,"178.",null,null,null,null,null,null,"",null,null,null,null,null,null,"453.",null,null,null,null,null,null,""]
[null,null,"179.",null,null,null,null,null,null,"",null,null,null,null,null,null,"454.",null,null,null,null,null,null,""]
[null,null,"180.",null,null,null,null,null,null,"",null,null,null,null,null,null,"455.",null,null,null,null,null,null,""]
[null,null,"181.",null,null,null,null,null,null,"",null,null,null,null,null,null,"456.",null,null,null,null,null,null,""]
[null,null,"182.",null,null,null,null,null,null,"",null,null,null,null,null,null,"457.",null,null,null,null,null,null,""]
[null,null,"183.",null,null,null,null,null,null,"",null,null,null,null,null,null,"458.",null,null,null,null,null,null,""]
[null,null,"184.",null,null,null,null,null,null,"",null,null,null,null,null,null,"459.",null,null,null,null,null,null,""]
[null,null,"185.",null,null,null,null,null,null,"",null,null,null,null,null,null,"460.",null,null,null,null,null,null,""]
[null,null,"186.",null,null,null,null,null,null,"",null,null,null,null,null,null,"461.",null,null,null,null,null,null,""]
[null,null,"187.",null,null,null,null,null,null,"",null,null,null,null,null,null,"462.",null,null,null,null,null,null,""]
[null,null,"188.",null,null,null,null,null,null,"",null,null,null,null,null,null,"463.",null,null,null,null,null,null,""]
[null,null,"189.",null,null,null,null,null,null,"",null,null,null,null,null,null,"464.",null,null,null,null,null,null,""]
[null,null,"190.",null,null,null,null,null,null,"",null,null,null,null,null,null,"465.",null,null,null,null,null,null,""]
[null,null,"191.",null,null,null,null,null,null,"",null,null,null,null,null,null,"466.",null,null,null,null,null,null,""]
[null,null,"192.",null,null,null,null,null,null,"",null,null,null,null,null,null,"467.",null,null,null,null,null,null,""]
[null,null,"193.",null,null,null,null,null,null,"",null,null,null,null,null,null,"468.",null,null,null,null,null,null,""]
[null,null,"194.",null,null,null,null,null,null,"",null,null,null,null,null,null,"469.",null,null,null,null,null,null,""]
[null,null,"195.",null,null,null,null,null,null,"",null,null,null,null,null,null,"470.",null,null,null,null,null,null,""]
[null,null,"196.",null,null,null,null,null,null,"",null,null,null,null,null,null,"471.",null,null,null,null,null,null,""]
[null,null,"197.",null,null,null,null,null,null,"",null,null,null,null,null,null,"472.",null,null,null,null,null,null,""]
[null,null,"198.",null,null,null,null,null,null,"",null,null,null,null,null,null,"473.",null,null,null,null,null,null,""]
[null,null,"199.",null,null,null,null,null,null,"",null,null,null,null,null,null,"474.",null,null,null,null,null,null,""]
[null,null,"200.",null,null,null,null,null,null,"",null,null,null,null,null,null,"475.",null,null,null,null,null,null,""]
[null,null,"201.",null,null,null,null,null,null,"",null,null,null,null,null,null,"476.",null,null,null,null,null,null,""]
[null,null,"202.",null,null,null,null,null,null,"",null,null,null,null,null,null,"477.",null,null,null,null,null,null,""]
[null,null,"203.",null,null,null,null,null,null,"",null,null,null,null,null,null,"478.",null,null,null,null,null,null,""]
[null,null,"204.",null,null,null,null,null,null,"",null,null,null,null,null,null,"479.",null,null,null,null,null,null,""]
[null,null,"205.",null,null,null,null,null,null,"",null,null,null,null,null,null,"480.",null,null,null,null,null,null,""]
[null,null,"206.",null,null,null,null,null,null,"",null,null,null,null,null,null,"481.",null,null,null,null,null,null,""]
[null,null,"207.",null,null,null,null,null,null,"",null,null,null,null,null,null,"482.",null,null,null,null,null,null,""]
[null,null,"208.",null,null,null,null,null,null,"",null,null,null,null,null,null,"483.",null,null,null,null,null,null,""]
[null,null,"209.",null,null,null,null,null,null,"",null,null,null,null,null,null,"484.",null,null,null,null,null,null,""]
[null,null,"210.",null,null,null,null,null,null,"",null,null,null,null,null,null,"485.",null,null,null,null,null,null,""]
[null,null,"211.",null,null,null,null,null,null,"",null,null,null,null,null,null,"486.",null,null,null,null,null,null,""]
[null,null,"212.",null,null,null,null,null,null,"",null,null,null,null,null,null,"487.",null,null,null,null,null,null,""]
[null,null,"213.",null,null,null,null,null,null,"",null,null,null,null,null,null,"488.",null,null,null,null,null,null,""]
[null,null,"214.",null,null,null,null,null,null,{"$f":"IF(ISBLANK(L209),\"\",VLOOKUP(L209,INDIRECT(CONCATENATE(\"LC_\",RIGHT($N$10,2))),2,FALSE))","v":""},null,null,null,null,null,null,"489.",null,null,null,null,null,null,{"$f":"IF(ISBLANK(Z209),\"\",VLOOKUP(Z209,INDIRECT(CONCATENATE(\"LC_\",RIGHT($N$10,2))),2,FALSE))","v":""}]
[null,null,"215.",null,null,null,null,null,null,"",null,null,null,null,null,null,"490.",null,null,null,null,null,null,""]
[null,null,"216.",null,null,null,null,null,null,"",null,null,null,null,null,null,"491.",null,null,null,null,null,null,""]
[null,null,"217.",null,null,null,null,null,null,"",null,null,null,null,null,null,"492.",null,null,null,null,null,null,""]
[null,null,"218.",null,null,null,null,null,null,"",null,null,null,null,null,null,"493.",null,null,null,null,null,null,""]
[null,null,"219.",null,null,null,null,null,null,"",null,null,null,null,null,null,"494.",null,null,null,null,null,null,""]
[null,null,"220.",null,null,null,null,null,null,"",null,null,null,null,null,null,"495.",null,null,null,null,null,null,""]
[null,null,"221.",null,null,null,null,null,null,"",null,null,null,null,null,null,"496.",null,null,null,null,null,null,""]
[null,null,"222.",null,null,null,null,null,null,"",null,null,null,null,null,null,"497.",null,null,null,null,null,null,""]
[null,null,"223.",null,null,null,null,null,null,"",null,null,null,null,null,null,"498.",null,null,null,null,null,null,""]
[null,null,"224.",null,null,null,null,null,null,"",null,null,null,null,null,null,"499.",null,null,null,null,null,null,""]
[null,null,"225.",null,null,null,null,null,null,"",null,null,null,null,null,null,"500.",null,null,null,null,null,null,""]
[null,null,"226.",null,null,null,null,null,null,"",null,null,null,null,null,null,"501.",null,null,null,null,null,null,""]
[null,null,"227.",null,null,null,null,null,null,"",null,null,null,null,null,null,"502.",null,null,null,null,null,null,""]
[null,null,"228.",null,null,null,null,null,null,"",null,null,null,null,null,null,"503.",null,null,null,null,null,null,""]
[null,null,"229.",null,null,null,null,null,null,"",null,null,null,null,null,null,"504.",null,null,null,null,null,null,""]
[null,null,"230.",null,null,null,null,null,null,"",null,null,null,null,null,null,"505.",null,null,null,null,null,null,""]
[null,null,"231.",null,null,null,null,null,null,"",null,null,null,null,null,null,"506.",null,null,null,null,null,null,""]
[null,null,"232.",null,null,null,null,null,null,"",null,null,null,null,null,null,"507.",null,null,null,null,null,null,""]
[null,null,"233.",null,null,null,null,null,null,"",null,null,null,null,null,null,"508.",null,null,null,null,null,null,""]
[null,null,"234.",null,null,null,null,null,null,"",null,null,null,null,null,null,"509.",null,null,null,null,null,null,""]
[null,null,"235.",null,null,null,null,null,null,"",null,null,null,null,null,null,"510.",null,null,null,null,null,null,""]
[null,null,"236.",null,null,null,null,null,null,"",null,null,null,null,null,null,"511.",null,null,null,null,null,null,""]
[null,null,"237.",null,null,null,null,null,null,"",null,null,null,null,null,null,"512.",null,null,null,null,null,null,""]
[null,null,"238.",null,null,null,null,null,null,"",null,null,null,null,null,null,"513.",null,null,null,null,null,null,""]
[null,null,"239.",null,null,null,null,null,null,"",null,null,null,null,null,null,"514.",null,null,null,null,null,null,""]
[null,null,"240.",null,null,null,null,null,null,"",null,null,null,null,null,null,"515.",null,null,null,null,null,null,""]
[null,null,"241.",null,null,null,null,null,null,"",null,null,null,null,null,null,"516.",null,null,null,null,null,null,""]
[null,null,"242.",null,null,null,null,null,null,"",null,null,null,null,null,null,"517.",null,null,null,null,null,null,""]
[null,null,"243.",null,null,null,null,null,null,"",null,null,null,null,null,null,"518.",null,null,null,null,null,null,""]
[null,null,"244.",null,null,null,null,null,null,"",null,null,null,null,null,null,"519.",null,null,null,null,null,null,""]
[null,null,"245.",null,null,null,null,null,null,"",null,null,null,null,null,null,"520.",null,null,null,null,null,null,""]
[null,null,"246.",null,null,null,null,null,null,"",null,null,null,null,null,null,"521.",null,null,null,null,null,null,""]
[null,null,"247.",null,null,null,null,null,null,"",null,null,null,null,null,null,"522.",null,null,null,null,null,null,""]
[null,null,"248.",null,null,null,null,null,null,"",null,null,null,null,null,null,"523.",null,null,null,null,null,null,""]
[null,null,"249.",null,null,null,null,null,null,"",null,null,null,null,null,null,"524.",null,null,null,null,null,null,""]
[null,null,"250.",null,null,null,null,null,null,"",null,null,null,null,null,null,"525.",null,null,null,null,null,null,""]
[null,null,"251.",null,null,null,null,null,null,"",null,null,null,null,null,null,"526.",null,null,null,null,null,null,""]
[null,null,"252.",null,null,null,null,null,null,"",null,null,null,null,null,null,"527.",null,null,null,null,null,null,""]
[null,null,"253.",null,null,null,null,null,null,"",null,null,null,null,null,null,"528.",null,null,null,null,null,null,""]
[null,null,"254.",null,null,null,null,null,null,"",null,null,null,null,null,null,"529.",null,null,null,null,null,null,""]
[null,null,"255.",null,null,null,null,null,null,"",null,null,null,null,null,null,"530.",null,null,null,null,null,null,""]
[null,null,"256.",null,null,null,null,null,null,"",null,null,null,null,null,null,"531.",null,null,null,null,null,null,""]
[null,null,"257.",null,null,null,null,null,null,"",null,null,null,null,null,null,"532.",null,null,null,null,null,null,""]
[null,null,"258.",null,null,null,null,null,null,"",null,null,null,null,null,null,"533.",null,null,null,null,null,null,""]
[null,null,"259.",null,null,null,null,null,null,"",null,null,null,null,null,null,"534.",null,null,null,null,null,null,""]
[null,null,"260.",null,null,null,null,null,null,"",null,null,null,null,null,null,"535.",null,null,null,null,null,null,""]
[null,null,"261.",null,null,null,null,null,null,"",null,null,null,null,null,null,"536.",null,null,null,null,null,null,""]
[null,null,"262.",null,null,null,null,null,null,"",null,null,null,null,null,null,"537.",null,null,null,null,null,null,""]
[null,null,"263.",null,null,null,null,null,null,"",null,null,null,null,null,null,"538.",null,null,null,null,null,null,""]
[null,null,"264.",null,null,null,null,null,null,"",null,null,null,null,null,null,"539.",null,null,null,null,null,null,""]
[null,null,"265.",null,null,null,null,null,null,"",null,null,null,null,null,null,"540.",null,null,null,null,null,null,""]
[null,null,"266.",null,null,null,null,null,null,"",null,null,null,null,null,null,"541.",null,null,null,null,null,null,""]
[null,null,"267.",null,null,null,null,null,null,"",null,null,null,null,null,null,"542.",null,null,null,null,null,null,""]
[null,null,"268.",null,null,null,null,null,null,"",null,null,null,null,null,null,"543.",null,null,null,null,null,null,""]
[null,null,"269.",null,null,null,null,null,null,"",null,null,null,null,null,null,"544.",null,null,null,null,null,null,""]
[null,null,"270.",null,null,null,null,null,null,"",null,null,null,null,null,null,"545.",null,null,null,null,null,null,""]
[null,null,"271.",null,null,null,null,null,null,"",null,null,null,null,null,null,"546.",null,null,null,null,null,null,""]
[null,null,"272.",null,null,null,null,null,null,"",null,null,null,null,null,null,"547.",null,null,null,null,null,null,""]
[null,null,"273.",null,null,null,null,null,null,"",null,null,null,null,null,null,"548.",null,null,null,null,null,null,""]
[null,null,"274.",null,null,null,null,null,null,"",null,null,null,null,null,null,"549.",null,null,null,null,null,null,""]
[null,null,"275.",null,null,null,null,null,null,"",null,null,null,null,null,null,"550.",null,null,null,null,null,null,""]
[null,null,"276.",null,null,null,null,null,null,"",null,null,null,null,null,null,"551.",null,null,null,null,null,null,""]
[null,null,"277.",null,null,null,null,null,null,"",null,null,null,null,null,null,"552.",null,null,null,null,null,null,""]
[null,null,"278.",null,null,null,null,null,null,{"$f":"IF(ISBLANK(L273),\"\",VLOOKUP(L273,INDIRECT(CONCATENATE(\"LC_\",RIGHT($N$10,2))),2,FALSE))","v":""},null,null,null,null,null,null,"553.",null,null,null,null,null,null,{"$f":"IF(ISBLANK(Z273),\"\",VLOOKUP(Z273,INDIRECT(CONCATENATE(\"LC_\",RIGHT($N$10,2))),2,FALSE))","v":""}]
[null,null,"279.",null,null,null,null,null,null,"",null,null,null,null,null,null,"554.",null,null,null,null,null,null,""]
[null,null,"280.",null,null,null,null,null,null,"",null,null,null,null,null,null,"555.",null,null,null,null,null,null,""]
[null,null,"281.",null,null,null,null,null,null,"",null,null,null,null,null,null,"556.",null,null,null,null,null,null,""]
[null,null,"282.",null,null,null,null,null,null,"",null,null,null,null,null,null,"557.",null,null,null,null,null,null,""]
[null,null,"283.",null,null,null,null,null,null,"",null,null,null,null,null,null,"558.",null,null,null,null,null,null,""]
[null,null,"284.",null,null,null,null,null,null,"",null,null,null,null,null,null,"559.",null,null,null,null,null,null,""]
[null,null,"285.",null,null,null,null,null,null,"",null,null,null,null,null,null,"560.",null,null,null,null,null,null,""]
[null,null,"286.",null,null,null,null,null,null,"",null,null,null,null,null,null,"561.",null,null,null,null,null,null,""]
[null,null,"287.",null,null,null,null,null,null,"",null,null,null,null,null,null,"562.",null,null,null,null,null,null,""]
[null,null,"288.",null,null,null,null,null,null,"",null,null,null,null,null,null,"563.",null,null,null,null,null,null,""]
[null,null,"289.",null,null,null,null,null,null,"",null,null,null,null,null,null,"564.",null,null,null,null,null,null,""]
[null,null,"290.",null,null,null,null,null,null,"",null,null,null,null,null,null,"565.",null,null,null,null,null,null,""]
[null,null,"291.",null,null,null,null,null,null,"",null,null,null,null,null,null,"566.",null,null,null,null,null,null,""]
[null,null,"292.",null,null,null,null,null,null,"",null,null,null,null,null,null,"567.",null,null,null,null,null,null,""]
[null,null,"293.",null,null,null,null,null,null,"",null,null,null,null,null,null,"568.",null,null,null,null,null,null,""]
[null,null,"294.",null,null,null,null,null,null,"",null,null,null,null,null,null,"569.",null,null,null,null,null,null,""]
[null,null,"295.",null,null,null,null,null,null,"",null,null,null,null,null,null,"570.",null,null,null,null,null,null,""]

{"sheet":"Glosario","index":10,"n_rows":336,"n_cols":27,"rows_kept":336,"cut":false,"hidden":false,"merged":[[19,3,19,29],[17,3,17,29],[15,2,15,29],[12,2,12,29],[0,1,0,29],[2,1,2,29],[4,1,4,29],[6,1,6,29],[8,26,8,29],[9,1,9,11],[9,13,9,14],[41,2,41,29],[38,2,38,29],[35,2,35,29],[32,2,32,29],[29,3,29,29],[27,3,27,29],[23,3,23,29],[21,3,21,29],[25,3,25,29],[67,3,67,29],[65,2,65,29],[62,2,62,29],[59,2,59,29],[56,2,56,29],[53,2,53,29],[50,2,50,29],[47,2,47,29],[44,2,44,29],[88,3,88,29],[86,3,86,29],[84,2,84,29],[81,2,81,29],[78,2,78,29],[75,3,75,29],[73,3,73,29],[71,3,71,29],[69,3,69,29],[113,2,113,29],[110,2,110,29],[107,2,107,29],[104,2,104,29],[101,2,101,29],[98,2,98,29],[95,3,95,29],[93,3,93,29],[91,2,91,29],[134,3,134,29],[132,3,132,29],[130,3,130,29],[128,3,128,29],[126,3,126,29],[124,3,124,29],[122,2,122,29],[119,2,119,29],[116,2,116,29],[154,3,154,29],[152,3,152,29],[150,3,150,29],[148,3,148,29],[146,3,146,29],[144,3,144,29],[142,2,142,29],[139,2,139,29],[136,3,136,29],[183,2,183,29],[180,2,180,29],[174,2,174,29],[171,2,171,29],[168,2,168,29],[165,2,165,29],[162,2,162,29],[159,2,159,29],[156,3,156,29],[177,2,177,29],[210,2,210,29],[207,2,207,29],[204,2,204,29],[201,2,201,29],[198,2,198,29],[195,2,195,29],[192,2,192,29],[189,2,189,29],[186,2,186,29],[231,3,231,29],[229,3,229,29],[227,3,227,29],[225,2,225,29],[222,2,222,29],[219,2,219,29],[216,2,216,29],[213,2,213,29],[212,1,212,29],[249,3,249,29],[247,3,247,29],[245,3,245,29],[243,3,243,29],[241,3,241,29],[239,3,239,29],[237,3,237,29],[235,3,235,29],[233,3,233,29],[268,2,268,29],[265,3,265,29],[263,3,263,29],[261,3,261,29],[259,3,259,29],[257,3,257,29],[255,3,255,29],[253,3,253,29],[251,3,251,29],[280,2,280,29],[283,2,283,29],[285,3,285,30],[286,2,286,29],[289,2,289,29],[292,2,292,29],[277,2,277,29],[274,2,274,29],[271,2,271,29],[309,3,309,29],[311,3,311,29],[313,3,313,29],[315,3,315,29],[295,2,295,29],[298,2,298,29],[301,2,301,29],[304,2,304,29],[307,2,307,29],[332,2,332,29],[335,2,335,29],[321,3,321,29],[325,3,325,29],[327,3,327,29],[323,3,323,29],[329,3,329,29],[317,3,317,29],[319,3,319,29]]}
[null,"CENSO NACIONAL DE GOBIERNOS\nESTATALES 2023"]
[]
[null,"Módulo 7.\nCatastro, registro y territorio"]
[]
[null,"Sección II. Registro Público de la Propiedad"]
[]
[null,"Glosario"]
[]
[null,"Entidad:",null,null,null,null,null,null,null,null,null,null,null,"Clave:",null,null,null,null,null,null,null,null,null,null,null,null,"Índice"]
[null,{"$f":"IF(Presentación!B10=\"\",\"\",Presentación!B10)","v":"Veracruz de Ignacio de la Llave"},null,null,null,null,null,null,null,null,null,null,null,{"$f":"Presentación!N10","v":"30"}]
[]
[null,"Acervo registral"]
[null,null,"Se refiere al conjunto de libros y documentos físicos y electrónicos existentes en las oficinas registrales, los cuales dan sustento a los asientos existentes en el mismo, y que requieren del resguardo por parte del Estado en función de su valor, tanto histórico como de consulta. "]
[]
[null,"Actividades que son susceptibles de registro o inscripción"]
[null,null,"Se refiere a los tipos de actividades que, consignadas en actos o contratos, al ser inscritos en la institución registral, producirán efectos declarativos o constitutivos. Para efectos del censo se definirán los siguientes tipos de actividades:"]
[]
[null,null,null,"Desarrollo urbano: Se refiere a la acción urbanística que consiste en los actos o actividades tendientes al uso o aprovechamiento del suelo dentro de áreas urbanizadas o urbanizables, tales como: subdivisiones, parcelaciones, fusiones, relotificaciones, fraccionamientos, condominios, conjuntos urbanos o urbanizaciones en general, así como de construcción, ampliación, remodelación, reparación, demolición o reconstrucción de inmuebles, de propiedad pública o privada, que por su naturaleza están determinadas en los planes o programas de desarrollo urbano o tienen los permisos correspondientes. Comprende también la realización de obras de equipamiento, infraestructura o servicios urbanos. \n\nEn la institución registral, se inscribirán los planes y programas estatales de desarrollo urbano, así como los planes y programas municipales en materia de desarrollo urbano, reservas, usos del suelo y destinos de áreas y predios, cuando estos tengan congruencia y estén ajustados con la planeación estatal y federal. Asimismo, se inscribirán los planes o programas de centros de población y los derivados de estos."]
[]
[null,null,null,"Inmobiliaria: Se refiere a todos aquellos actos que inciden sobre bienes inmuebles. Se consideran bienes inmuebles: \n\nI. El suelo y las construcciones adheridas a él;\nII. Las plantas y árboles, mientras estuvieren unidos a la tierra, y los frutos pendientes de los mismos árboles y plantas mientras no sean separados de ellos por cosechas o cortes regulares;\nIII. Todo lo que esté unido a un inmueble de una manera fija, de modo que no pueda separarse sin deterioro del mismo inmueble o del objeto a él adherido;\nIV. Las estatuas, relieves, pinturas u otros objetos de ornamentación, colocados en edificios o heredados por el dueño del inmueble, en tal forma que revele el propósito de unirlos de un modo permanente al fundo;\nV. Los palomares, colmenas, estanques de peces o criaderos análogos, cuando el propietario los conserve con el propósito de mantenerlos unidos a la finca y formando parte de ella de un modo permanente;\nVI. Las máquinas, vasos, instrumentos o utensilios destinados por el propietario de la finca directa y exclusivamente, a la industria o explotación de la misma;\nVII. Los abonos destinados al cultivo de una heredad, que estén en las tierras donde hayan de utilizarse, y las semillas necesarias para el cultivo de la finca;\nVIII. Los aparatos eléctricos y accesorios adheridos al suelo o a los edificios por el dueño de éstos, salvo convenio en contrario;\nIX. Los manantiales, estanques, aljibes y corrientes de agua, así como los acueductos y las cañerías de cualquiera especie que sirvan para conducir los líquidos o gases a una finca o para extraerlos de ella;\nX. Los animales que formen el pie de cría en los predios rústicos destinados total o parcialmente al ramo de ganadería; así como las bestias de trabajo indispensables en el cultivo de la finca, mientras están destinadas a ese objeto;\nXI. Los diques y construcciones que, aun cuando sean flotantes, estén destinados por su objeto y condiciones a permanecer en un punto fijo de un río, lago o costa;\nXII. Los derechos reales sobre inmuebles;\nXIII. Las líneas telefónicas y telegráficas y las estaciones radiotelegráficas fijas"]
[]
[null,null,null,"Mercantil: Se refiere a todos aquellos actos considerados como mercantiles o de comercio. Se consideran actos de comercio:\n\nI. Todas las adquisiciones, enajenaciones y alquileres verificados con propósito de especulación comercial, de mantenimientos, artículos, muebles o mercaderías, sea en estado natural, sea después de trabajados o labrados;\nII. Las compras y ventas de bienes inmuebles, cuando se hagan con dicho propósito de especulación comercial;\nIII. Las compras y ventas de porciones, acciones y obligaciones de las sociedades mercantiles;\nIV. Los contratos relativos y obligaciones del Estado ú otros títulos de crédito corrientes en el comercio;\nV. Las empresas de abastecimientos y suministros;\nVI. Las empresas de construcciones, y trabajos públicos y privados;\nVII. Las empresas de fábricas y manufacturas;\nVIII. Las empresas de trasportes de personas o cosas, por tierra o por agua; y las empresas de turismo.\nIX. Las librerías, y las empresas editoriales y tipográficas;\nX. Las empresas de comisiones, de agencias, de oficinas de negocios comerciales, casas de empeño y establecimientos de ventas en pública almoneda;\nXI. Las empresas de espectáculos públicos;\nXII. Las operaciones de comisión mercantil;\nXIII. Las operaciones de mediación de negocios mercantiles;\nXIV. Las operaciones de bancos;\nXV. Todos los contratos relativos al comercio marítimo y a la navegación interior y exterior;\nXVI. Los contratos de seguros de toda especie;\nXVII. Los depósitos por causa de comercio;\nXVIII. Los depósitos en los almacenes generales y todas las operaciones hechas sobre los certificados de depósito y bonos de prenda librados por los mismos;\nXIX. Los cheques, letras de cambio o remesas de dinero de una plaza a otra, entre toda clase de personas;\nXX. Los vales ú otros títulos a la orden o al portador, y las obligaciones de los comerciantes, a no ser que se pruebe que se derivan de una causa extraña al comercio;\nXXI. Las obligaciones entre comerciantes y banqueros, si no son de naturaleza esencialmente civil;\nXXII. Los contratos y obligaciones de los empleados de los comerciantes en lo que concierne al comercio del negociante que los tiene a su servicio;\nXXIII. La enajenación que el propietario o el cultivador hagan de los productos de su finca o de su cultivo;\nXXIV. Las operaciones contenidas en la Ley General de Títulos y Operaciones de Crédito;"]
[]
[null,null,null,"Mobiliaria: Se refiere a aquellos actos que inciden sobre bienes muebles. Los bienes son muebles por su naturaleza o por disposición de la ley.\n\nI. Son muebles por su naturaleza, los cuerpos que pueden trasladarse de un lugar a otro, ya se muevan por sí mismos, ya por efecto de una fuerza exterior. \nII. Son bienes muebles por determinación de la ley, las obligaciones y los derechos o acciones que tienen por objeto cosas muebles o cantidades exigibles en virtud de acción personal. \nIII. Por igual razón se reputan muebles las acciones que cada socio tiene en las asociaciones o sociedades, aun cuando a éstas pertenezcan algunos bienes inmuebles.\nIV. Las embarcaciones de todo género son bienes muebles. \nV. Los materiales procedentes de la demolición de un edificio, y los que se hubieren acopiado para repararlo o para construir uno nuevo, serán muebles mientras no se hayan empleado en la fabricación. \nVI. Los derechos de autor se consideran bienes muebles. \nVII. En general, son bienes muebles, todos los demás no considerados por la ley como inmuebles."]
[]
[null,null,null,"Notarial: Se refiere a la actividad ejercida por el notario, que es un profesional del derecho, investido de fe pública por el Estado, que brinda seguridad jurídica y certeza en los actos y hechos de los que da fe, manteniendo siempre un alto nivel de profesionalismo, total imparcialidad con los prestatarios del servicio y plena autonomía en sus decisiones, las cuales solo tienen por límite el marco jurídico y el Estado de Derecho.\n\nEl notario ejerce su función con independencia del poder público y los particulares. Es así como recibe, interpreta, redacta y da forma legal a la voluntad de los comparecientes al plasmarla en un instrumento público y auténtico, redactado bajo su responsabilidad y que puede ser una escritura pública, si se trata de dar fe de un acto jurídico; por ejemplo, un contrato; o bien un acta notarial, si se certifica un hecho jurídico o material, por ejemplo, una notificación o una fe de hechos.\n\nEl notario conserva y reproduce el instrumento, brindando así seguridad y tranquilidad a la sociedad. También auxilia a las autoridades locales y federales en el cálculo y cobro de impuestos y derechos; y vigila que se registren los actos que ante él se otorgan."]
[]
[null,null,null,"Personas morales de carácter civil: Se refiere a las personas morales, colectivas o jurídicas como aquellas entidades (normalmente grupos de individuos) a las cuales el derecho considera como una sola entidad para que actúe como tal en la vida jurídica. De forma específica, las personas morales tendrán naturaleza civil, si su objeto no es preponderantemente económico (asociaciones), o en caso de serlo, este no constituye una especulación comercial (sociedades)."]
[]
[null,null,null,"Testamentaria: Se refiere a aquellos actos que versan sobre las sucesiones. Se define a la herencia, como la sucesión en todos los bienes del difunto y en todos sus derechos y obligaciones que no se extinguen por la muerte. La herencia se defiere por la voluntad del testado o por disposición de la ley. La primera se llama testamentaria y la segunda, legítima.\n\nSe define al testamento como un acto personalísimo, revocable y libre, por el cual una persona capaz dispone de sus bienes y derechos, y declara o cumple deberes para después de su muerte."]
[]
[null,"Administración Pública Estatal Centralizada"]
[null,null,"Se refiere al conjunto de instituciones o dependencias de la Administración Pública de la entidad federativa que, de acuerdo con la ley orgánica respectiva, fueron creadas para el despacho de los negocios de orden administrativo encomendados al Poder Ejecutivo Estatal, tales como: la oficina del(a) Gobernador(a) u homóloga, las secretarías, la consejería jurídica u homóloga y las demás instituciones que la disposición normativa en la materia establezca."]
[]
[null,"Administración Pública Estatal Descentralizada"]
[null,null,"Se refiere a la entidad de la administración pública creada por ley o decreto del Congreso o por decreto del Ejecutivo estatal, con personalidad jurídica y patrimonio propio, cualquiera que sea la estructura legal que adopten, constituida con fondos o bienes provenientes de la administración pública estatal. Su objetivo es la prestación de un servicio público o social, la explotación de bienes o recursos propiedad del Estado."]
[]
[null,"Administración Pública Estatal Desconcentrada"]
[null,null,"Se refiere a las entidades jerárquicamente subordinadas a las instituciones, con facultades específicas para resolver asuntos en la materia encomendada de conformidad con las disposiciones legales aplicables. Los órganos desconcentrados cuentan con autonomía administrativa, pero no tienen responsabilidad jurídica ni patrimonio propio. Es importante señalar que los recursos ejercidos por los órganos administrativos desconcentrados forman parte del gasto del ramo administrativo que los coordina sectorialmente."]
[]
[null,"Alerta inmobiliaria"]
[null,null,"Se refiere al servicio mediante el cual, a través de dispositivos móviles, cuentas de correo electrónico u otros medios, se notifica de forma inmediata al titular registrado sobre cualquier tipo de consulta o movimiento que se lleve a cabo sobre su predio, a efecto de alertar sobre posibles modificaciones en su situación jurídica."]
[]
[null,"Anotación marginal"]
[null,null,"Se refiere a la referencia vinculatoria a otra inscripción que indica una situación jurídica con el bien o derecho que ampara dicha inscripción."]
[]
[null,"Anotación preventiva"]
[null,null,"Se refiere a las anotaciones que previenen a terceros sobre determinada circunstancia anotada y tienden a convertirse en definitivas o a quedar sin razón de ser por producirse los efectos para las cuales se solicitaron."]
[]
[null,"Cancelación de inscripción"]
[null,null,"Se refiere al acto a través del cual se anula y se deja sin efectos parcial o totalmente una anotación o una inscripción, por haberse transmitido o extinguido un derecho en todo o en parte."]
[]
[null,"Cancelaciones"]
[null,null,"Se refiere a las cancelaciones realizadas sobre las limitaciones existentes. Las inscripciones pueden cancelarse por consentimiento de las personas a cuyo favor estén hechas o por orden judicial. Podrán no obstante ser canceladas a petición de parte, sin dichos requisitos, cuando el derecho inscrito o anotado quede extinguido por disposición de la ley o por causas que resulten del título en cuya virtud se practicó la inscripción, debido a hecho que no requiera la intervención de la voluntad."]
[]
[null,"Capitulaciones matrimoniales"]
[null,null,"Se refiere a los pactos que los esposos celebran para constituir la sociedad conyugal o la separación de bienes y reglamentar la administración de estos en uno y en otro caso."]
[]
[null,"Catastro"]
[null,null,"Se refiere al inventario público, sistemáticamente organizado, gráfico y alfanumérico descriptivo de los bienes inmuebles urbanos, rurales y de características especiales de un país. Es el término empleado para designar una serie de registros que muestran la extensión, el valor y la propiedad (u otro fundamento del uso o de la ocupación) de la tierra."]
[]
[null,"Cédula única catastral y registral "]
[null,null,"Se refiere al documento electrónico oficial a utilizar por las instituciones catastrales y registrales, mismo que se constituye como la base fundamental para captar información estadística y geográfica para el SNIEG, la cual contiene los elementos mínimos obligatorios y opcionales que identifican aspectos jurídicos y técnicos de un predio para garantizar la asociación entre la información catastral y registral."]
[]
[null,"Certificación"]
[null,null,"Se refiere al acto a través del cual el registrador da fe de los actos o constancias inscritos en el folio o en el libro correspondiente, así como del contenido de los documentos de los archivos de la institución a su cargo. Para efectos del censo se definirán los siguientes certificados:"]
[]
[null,null,null,"Certificado de gravamen o libertad de gravamen: Se refiere a aquel en el que se hace constar la existencia de los gravámenes reales de una finca, tales como las hipotecas, prendas y servidumbres; o bien, aquel en el que se hace constar que una finca está libre de gravámenes reales.\t\t\t\t\t\t\t"]
[]
[null,null,null,"Certificado de historia registral: Se refiere a aquel que contiene la descripción de un inmueble, así como las anotaciones con que cuenta una inscripción y la relación de todos los antecedentes registrales, hasta la inscripción primordial."]
[]
[null,null,null,"Certificado de inscripción o no inscripción de predio: Se refiere a aquel que certifica que un bien inmueble determinado se encuentra inscrito en la institución registral; o bien, aquel en el que se hace constar que un bien inmueble determinado no se encuentra inscrito en la institución registral.\t\t\t\t\t\t"]
[]
[null,null,null,"Certificado de propiedad o no propiedad: Se refiere a aquel en el que se describen todos los predios pertenecientes a una persona física o moral; o bien, aquel en el que se hace constar que en los archivos de la institución registral no existe registro de bienes inmuebles a favor de determinada persona física o moral."]
[]
[null,null,null,"Copias certificadas: Se refiere a la expedición de copias de inscripciones o de documentos agregados al apéndice, debidamente autentificados."]
[]
[null,"Clave catastral"]
[null,null,"Se refiere al código que identifica al predio de forma única para su localización geográfica, mismo que es asignado a cada uno de ellos en el momento de su inscripción en el padrón catastral por las Unidades del Estado con atribuciones catastrales."]
[]
[null,"CNGE 2023"]
[null,null,"Se refiere a las siglas con las que se identifica al Censo Nacional de Gobiernos Estatales 2023."]
[]
[null,"Contratos"]
[null,null,"Se refiere a los convenios que producen o transfieren las obligaciones y derechos. Para efectos del censo se definirán los siguientes contratos:"]
[]
[null,null,null,"Arrendamiento: Se refiere al contrato por medio del cual, las dos partes contratantes se obligan recíprocamente, una, a conceder el uso o goce temporal de un bien inmueble, y la otra, a pagar por ese uso o goce un precio cierto."]
[]
[null,null,null,"Comodato: Se refiere al contrato por el cual uno de los contratantes se obliga a conceder gratuitamente el uso de una cosa no fungible, y el otro contrae la obligación de restituirla individualmente."]
[]
[null,"Derechos reales"]
[null,null,"Se refiere a aquellos derechos relacionados a la propiedad, posesión, usufructo, servidumbre, uso y habitación y los que sirven de garantía para un derecho de crédito, prenda e hipoteca, de bienes raíces susceptibles de inscripción en la institución registral. Para efectos del censo se definirán los siguientes derechos reales:"]
[]
[null,null,null,"Servidumbre: Se refiere al gravamen real impuesto sobre un inmueble en beneficio de otro perteneciente a distinto dueño."]
[]
[null,null,null,"Usufructo: Se refiere al derecho real y temporal de disfrutar de los bienes ajenos."]
[]
[null,"Digitalización"]
[null,null,"Se refiere al proceso de dar entrada electrónica a documentos fuente, tomando la imagen de un documento como un objeto para su futuro procesamiento, almacenamiento, recuperación y acceso de la información contenida en el mismo. En todos los casos la digitalización de documentos registrales debe garantizar la consistencia y el tracto registral entre los documentos en papel, su imagen digitalizada y la base de datos electrónica."]
[]
[null,"Documentos electrónicos"]
[null,null,"Se refiere a cualquier tipo de comunicación que puede ser enviada, recibida, procesada y archivada con el soporte de las tecnologías de información con los que cuente una organización. Un documento electrónico es el archivo electrónico firmado electrónicamente."]
[]
[null,"Estadísticas de operación"]
[null,null,"Se refiere a aquellas que se generan con base a las operaciones que realizan las instituciones registrales en su gestión. "]
[]
[null,"Firma electrónica"]
[null,null,"Se refiere a los datos en forma electrónica consignados en un mensaje de datos, o adjuntados o lógicamente asociados al mismo, que pueden ser utilizados para identificar al firmante en relación con el mensaje de datos e indicar que el firmante aprueba la información recogida en el mensaje.\n\nEl concepto de firma electrónica aspira a abarcar todos los usos tradicionales de una firma manuscrita con consecuencias jurídicas, siendo la identificación del firmante y la intención de firmar solo el mínimo común denominador de los diversos criterios relativos a la firma que se encuentran en los diversos ordenamientos jurídicos.\n\nEn consecuencia, definir una firma electrónica como capaz de indicar la aprobación de la información, equivale a establecer un requisito técnico previo para el reconocimiento de una determinada tecnología apta para crear el equivalente de una firma manuscrita."]
[]
[null,"Folio real electrónico"]
[null,null,"Se refiere al expediente electrónico y digital en el que se practican las inscripciones o anotaciones, mismo que se identifica de manera única a través de una clave; además contiene toda la información registral referida a un predio (superficie, linderos, colindancias titularidad y gravámenes vigentes), considerando cada uno de estos como una unidad registral con historial jurídico propio."]
[]
[null,"Folio real físico"]
[null,null,"Se refiere a un registro en papel, con el que se identifica con una clave de manera única destinado a inscribir e inmatricular cada una de las fincas, superficies, linderos y colindancias; basta su consulta para conocer la titularidad y gravámenes vigentes sobre el inmueble."]
[]
[null,"Formas precodificadas"]
[null,null,"Se refiere al documento base del sistema registral electrónico que contiene los datos esenciales sobre un acto registrable o un asiento registral, necesarios para su calificación y en su caso inscripción electrónica."]
[]
[null,"FOVISSSTE"]
[null,null,"Se refiere al Fondo de la Vivienda del Instituto de Seguridad y Servicios Sociales de los Trabajadores del Estado."]
[]
[null,"Fusión o división"]
[null,null,"Se refiere a los actos por los cuales se da la unión o separación de predios. Para efectos del censo se definirán los siguientes actos de fusión o división:"]
[]
[null,null,null,"Constitución de régimen de propiedad en condominio: Se refiere al acto por el cual se crea el régimen de propiedad de un bien inmueble construido o baldío, susceptible de aprovechamiento independientemente por tener salida propia a un elemento común de aquel o a la vía pública y que pertenece a distintos propietarios, los que tendrían derecho privativo o exclusivo de propiedad y además un derecho común de copropiedad sobre los elementos y partes comunes del inmueble, necesarios para el adecuado uso y disfrute."]
[]
[null,null,null,"División de cosa común (copropiedad): Se refiere a una de las formas por las que cesa la copropiedad."]
[]
[null,null,null,"Fraccionamiento: Se refiere a cualquier división del terreno en lotes destinados a la venta y a los siguientes usos: habitación, escuelas, recreación, comercio, industria, servicios y cualquiera otros que se les designe."]
[]
[null,null,null,"Fusión de predios: Se refiere a la unión de dos o más propiedades colindantes en un solo predio."]
[]
[null,null,null,"Lotificación: Se refiere a la división de un terreno en lotes, con fines urbanos. Es un fenómeno de ordenación urbana y debe responder por consecuencia a una justa distribución de cargas entre los interesados o dueños de lote, como son servicios comunitarios e infraestructura urbana."]
[]
[null,null,null,"Relotificación: Se refiere al acto por el cual, a dos o más lotes o áreas privativas, según corresponda, se le modifican las dimensiones o las ubicaciones originalmente establecidas en la autorización del conjunto urbano, subdivisión o condominio. También se entiende como un cambio de la distribución o dimensiones de los lotes de un predio cuyas características hayan sido autorizadas con anterioridad."]
[]
[null,null,null,"Subdivisión: Se refiere a la partición de un predio, cuya superficie no debe fraccionarse mediante vías públicas para formar unidades o manzanas."]
[]
[null,"Grandes usuarios"]
[null,null,"Se refiere a aquellos que realizan trámites registrales de forma masiva, tales como notarios, INFONAVIT, FOVISSSTE, SHF, entre otros."]
[]
[null,"Gravámenes"]
[null,null,"Se refiere a la palabra que se utiliza como sinónimo de diferentes conceptos jurídicos en relación a las cargas u obligaciones que afectan a una persona o bien. En este sentido se habla de gravámenes reales como las hipotecas, prendas y servidumbres; o de gravámenes personales que se refieren propiamente a las obligaciones. Los primeros deberán estar inscritos en la institución registral a fin de que surtan efectos contra terceros, en virtud de que se trata de una limitación a la disponibilidad del bien inscrito, o de una disminución de su valor, dependiendo del gravamen del que se trate. Su inscripción se hará constar en el folio de la finca sobre la cual recaigan. Para efectos del censo se definirán los siguientes gravámenes:"]
[]
[null,null,null,"Cédula hipotecaria: Se refiere a los títulos de valor emitidos por una persona física o moral (institución de crédito hipotecario) que otorga a su tenedor una garantía hipotecaria, constituida por el acreditado y le confiere derecho al interés fijado."]
[]
[null,null,null,"Cesión de crédito hipotecario: Se refiere al acto por el cual el crédito puede cederse, en todo o en parte, siempre que la cesión se haga en la forma que para la constitución de la hipoteca previene en la ley en la materia, se dé conocimiento al deudor y sea inscrita en la institución registral."]
[]
[null,null,null,"Constitución de reserva de dominio: Se refiere al acto por el cual se reserva la propiedad de bien determinado; constituye, por lo tanto, una limitación al dominio de este. Puede darse en los contratos de compraventa, donación, entre otros."]
[]
[null,null,null,"Crédito o hipoteca: Se refiere a la garantía real constituida sobre bienes que no se entregan al acreedor, y que da derecho a este, en caso de incumplimiento de la obligación garantizada, a ser pagado con el valor de los bienes, en el grado de preferencia establecido por la ley."]
[]
[null,null,null,"Embargo: Se refiere a la afectación decretada por una autoridad competente sobre un bien o conjunto de bienes de propiedad privada, la cual tiene por objeto asegurar cautelarmente la eventual ejecución de una pretensión de condena que se plantea o planteará en juicio (embargo preventivo, provisional o cautelar), o bien satisfacer directamente una pretensión ejecutiva (embargo definitivo, ejecutivo o apremiativo)."]
[]
[null,null,null,"Fianza: Se refiere al contrato por el cual una persona se compromete con el acreedor a pagar por el deudor, si este no lo hace."]
[]
[null,null,null,"Mutuo con garantía hipotecaria: Se refiere al contrato de mutuo que se constituye con garantía real de hipoteca. Mutuo es un contrato por el cual el mutuante se obliga a transferir la propiedad de una suma de dinero o de otras cosas fungibles al mutuario, quien se obliga a devolver otro tanto de la misma especie y calidad."]
[]
[null,"INDAABIN"]
[null,null,"Se refiere al Instituto de Administración y Avalúos de Bienes Nacionales."]
[]
[null,"Indexación"]
[null,null,"Se refiere a los índices de acceso a libros y legajos y su relación con la base de datos registral."]
[]
[null,"Indicadores de operación"]
[null,null,"Se refiere a aquellos que se generan para conocer las operaciones que realizan las instituciones registrales en su gestión."]
[]
[null,"Indicadores de servicios"]
[null,null,"Se refiere a aquellos que se generan para medir la calidad en el servicio, por lo que reflejan la eficiencia y calidad de los servicios que se prestan en la institución registral."]
[]
[null,"INEGI"]
[null,null,"Se refiere al Instituto Nacional de Estadística y Geografía."]
[]
[null,"INFONAVIT"]
[null,null,"Se refiere al Instituto del Fondo Nacional de la Vivienda para los Trabajadores."]
[]
[null,"Información existente en la institución registral"]
[null,null,"Se refiere a los asientos, inscripciones, libros, legajos, folios reales físicos o electrónicos, y en general, todos aquellos elementos que conforman el acervo documental de la institución registral."]
[]
[null,"Informante básico"]
[null,null,"Se refiere al titular o servidor público de la institución designado para proveer la información de la presente sección, y que tiene el carácter de figura responsable de validar y oficializar la información. Cuando menos, se encuentra en el segundo o tercer nivel jerárquico de la misma."]
[]
[null,"Informante complementario 1"]
[null,null,"Se refiere al servidor público que, por las funciones que tiene asignadas dentro de la institución, es el principal productor y/o integrador de la información correspondiente a la presente sección y, cuando menos, se encuentra en el segundo o tercer nivel jerárquico de la misma."]
[]
[null,"Informante complementario 2"]
[null,null,"Se refiere al servidor público que, por las funciones que tiene asignadas dentro de la institución, es el segundo principal productor y/o integrador de la información correspondiente a la presente sección y, cuando menos, se encuentra en el segundo o tercer nivel jerárquico de la misma."]
[]
[null,"Inscripciones registrales"]
[null,null,"Se refiere a aquellos asientos o inscripciones en los que quedan registrados los movimientos que sufren los bienes inmuebles, bienes muebles, actos mercantiles, personas morales de carácter civil o mercantil, entre otros y que pueden o no formar parte de un folio real físico o un folio real electrónico."]
[]
[null,"INSUS"]
[null,null,"Se refiere al Instituto Nacional del Suelo Sustentable."]
[]
[null,"Legajos"]
[null,null,"Se refiere al conjunto de documentos que son relativos una inscripción o registro determinado que archivan ordenadamente en el acervo registral y que han de surtir efectos en la institución registral, sin que estos consten incorporados a la inscripción registral. "]
[]
[null,"Libros"]
[null,null,"Se refiere al compendio de asientos registrales."]
[]
[null,"Manual de organización"]
[null,null,"Se refiere a aquellos instrumentos de apoyo administrativo que describen en forma ordenada y sistemática las relaciones orgánicas que se dan entre los elementos de la estructura organizacional de una determinada unidad administrativa."]
[]
[null,"Manual de procedimientos"]
[null,null,"Se refiere al documento de carácter técnico donde se identifican los procesos de trabajo, tanto sustantivos como administrativos, con el objetivo de coordinar y sistematizar las funciones en un marco de transparencia y eficiencia."]
[]
[null,"Manzana"]
[null,null,"Se refiere a la extensión territorial que está constituida por un grupo de viviendas, edificios, predios, lotes o terrenos de uso habitacional, comercial, industrial o de servicios; generalmente se puede rodear en su totalidad y está delimitada por calles, andadores, brechas, veredas, cercas, arroyos, barrancos o límites prediales."]
[]
[null,"Modificación de medidas y linderos"]
[null,null,"Se refiere a modificación de los límites previamente determinados de un predio, en relación con sus colindantes."]
[]
[null,"Norma Técnica para la Generación, Captación e Integración de Datos Catastrales y Registrales con fines estadísticos y geográficos"]
[null,null,"Se refiere al documento que contiene las disposiciones que establecen las especificaciones técnicas para la generación, captación e integración de datos catastrales y registrales."]
[]
[null,"Otras instituciones"]
[null,null,"Se refiere a aquellas que tienen relación con la actividad registral, tales como catastro, RAN, INDAABIN, entre otros."]
[]
[null,"Patrimonio de familia"]
[null,null,"Se refiere a aquel que puede constituirse sobre la casa habitación de la familia y en algunos casos, sobre una parcela cultivable. Solo puede constituirse el patrimonio de la familia con bienes sitos en el lugar en que esté domiciliado el que lo constituya. Tienen derecho de habitar la casa y de aprovechar los frutos de la parcela afecta al patrimonio de la familia el cónyuge del que lo constituye y las personas a quienes tiene obligación de dar alimentos. Los bienes afectos al patrimonio de la familia son inalienables y no estarán sujetos a embargo ni a gravamen alguno."]
[]
[null,"Portal"]
[null,null,"Se refiere a la interfaz y/o punto de contacto del usuario con los sistemas informáticos de una institución, utilizando como medio la red global de comunicación pública denominada Internet y/o utilizando la red de comunicaciones privada denominada Intranet de la institución."]
[]
[null,"Principios registrales"]
[null,null,"Se refiere a las orientaciones capitales, líneas directrices, serie sistemática de bases fundamentales del ordenamiento jurídico registral. Para efectos del censo se definirán los siguientes principios registrales:"]
[]
[null,null,null,"Apariencia jurídica: Se refiere al principio mediante el cual, los actos realizados por una persona engañada por una situación jurídica que es contraria a la realidad, pero que presenta exteriormente las características de una situación jurídica verdadera, son definitivos y oponibles como lo serían los actos fundados en situaciones absolutamente regulares. "]
[]
[null,null,null,"Consentimiento: Se refiere a la necesidad del consentimiento de quien aparece inscrito, para que se cancele su inscripción y se haga una diferente a favor de otra persona, y cuya conformidad debe, además, constar en escritura pública.\n\nPara que el registro se realice, debe basarse la inscripción en el consentimiento de la parte perjudicada en su derecho; es decir, debe basarse en un acuerdo de voluntades entre el transferente (perjudicado) y el adquirente (beneficiado); y como solo puede consentir el que puede disponer, solo puede consentir el verdadero titular. En sentido negativo, nadie puede ser dado de baja en el registro sin su consentimiento."]
[]
[null,null,null,"Desarrollo multifinalitario: Se refiere al principio que se desarrolla con la participación de especialistas en las distintas disciplinas de las ciencias de la tierra y afines, utilizando las tecnologías de la información y comunicaciones."]
[]
[null,null,null,"Equivalencia funcional: Se refiere al principio que señala que no se negarán efectos jurídicos, validez o fuerza obligatoria a la información por la sola razón de que esté en forma de mensaje de datos. No se discriminará entre el documento escrito y el electrónico, y en caso de que la legislación aplicable requiera que la información conste por escrito, el requisito quedará satisfecho con el mensaje de datos si la información que contiene es accesible y segura para posterior consulta. Tanto la información escrita como en formato electrónico tendrán la fuerza probatoria que señalen las leyes."]
[]
[null,null,null,"Especialidad o determinación: Se refiere no solo en la necesidad de determinar y concretar en la inscripción los créditos garantizados y las fincas gravadas cuando se trata de una hipoteca, sino también en la necesidad de que en toda inscripción de propiedad u otros derechos reales sobre inmuebles se especifiquen pormenorizadamente las características del inmueble objeto del derecho real: su valor, la naturaleza del derecho, el acto jurídico que le dio origen, los nombres y generales de las personas que intervinieron en el acto, así como la fecha del título y el funcionario que lo autorizó.\n\nA este principio se le ha llamado también principio de Determinación, porque la publicidad registral exige determinar con precisión el bien objeto de los derechos, probablemente el término Especialidad nació como oposición o reacción contra la “generalidad” de las hipotecas."]
[]
[null,null,null,"Fe pública registral: Se refiere al principio que consiste en la necesidad de tener como verdad única y total a propósito de un determinado derecho real inmobiliario, exclusivamente los datos que aparecen inscritos en la institución registral, tanto para saber si el titular inscrito de ese derecho real puede disponer de él válidamente, como para saber si es válida la adquisición del mismo derecho por un tercero de buena fe que se atuvo a esos datos registrales y confió en ellos para adquirirlo."]
[]
[null,null,null,"Identidad: Se refiere al medio por el cual, los entes generadores de la cartografía identifican al objeto territorial en el espacio geográfico, independientemente del dominio o posesión."]
[]
[null,null,null,"Inscripción: Se refiere a todo asiento hecho en la institución registral; también significa el acto mismo de inscribir. Los derechos nacidos extrarregistralmente, al inscribirse, adquieren mayor firmeza y protección, por la fuerza probatoria que el registro les da.\n\nEste principio tiende a precisar la influencia que el registro ejerce en los derechos sobre inmuebles y también decide si la inscripción en la institución registral es elemento determinante o no para que el negocio dispositivo provoque el efecto jurídico. En México, el acto nace fuera de la institución registral, ante Notario, por lo que no existen inscripciones constitutivas, ni menos sustantivas, simplemente declarativas."]
[]
[null,null,null,"Legalidad y calificación registral: Se refiere al principio que impide el ingreso la institución registral de títulos inválidos o imperfectos, por lo tanto, todo lo registrado se presume que lo ha sido legalmente; y el medio de lograrlo es someter los títulos a examen, que es lo que se llama calificación registral.\n\nEn suma, este principio consiste en la función atribuida al personal la institución registral para examinar cada uno de los documentos que se presentan para su inscripción y determinar no solo si es de los documentos susceptibles de inscribirse, sino también si el acto que contiene satisface los requisitos de forma exigidos por cualquier ley, a fin de proceder en caso afirmativo a llevar a cabo la inscripción solicitada, previo el pago de los derechos correspondientes del registro o, en caso contrario, a suspenderla si el documento tiene defectos subsanables o denegarla si los defectos son insubsanables."]
[]
[null,null,null,"Legitimación: Se refiere al principio por el cual, el titular (verdadero) de un derecho subjetivo está legitimado (con poder jurídico legal) para exigir que exista a su favor una exteriorización (apariencia) de su derecho, es decir, para hacer concordar su titularidad (derecho subjetivo) con la situación posesoria o registral. Ejemplo: El dueño puede poseer, gozar, administrar su propiedad y registrar su título. Si a pesar de los medios o poderes que la ley le concede, el legitimado no actúa y no logra esa concordancia, surge la necesidad de proteger la apariencia jurídica, pues cuando hay discordancia entre el titular verdadero y el titular aparente, se produce una apariencia de titularidad. La legitimación tiende a proteger al verdadero titular del derecho subjetivo (ordinaria) y solo por necesidad y forzada, la norma protege a veces (extraordinaria) al titular aparente."]
[]
[null,null,null,"Oponibilidad: Se refiere a la facultad del legítimo titular del derecho real consignado en la inscripción de exhibir su derecho como prevalente y prioritario frente a terceros contra prueba en contrario."]
[]
[null,null,null,"Prioridad o prelación: Se refiere a que la preferencia entre derechos reales sobre una misma finca se determina por el orden de la registración y no por la antigüedad del otorgamiento del título. La fecha de presentación va a determinar la preferencia y rango del documento que ha ingresado a registro. Este principio únicamente se concibe por la posibilidad que se da de que existan dos o más títulos contradictorios. "]
[]
[null,null,null,"Propiedad: Se refiere al principio conforme al cual, ante la existencia de dos títulos contradictorios, prevalece el primero que se haya inscrito."]
[]
[null,null,null,"Publicidad: Se refiere al principio en el que, al realizarse el registro se revela la situación jurídica de los inmuebles y toda persona, sea o no tercero registral o interesado, tiene derecho de que se le muestren los asientos del registro y de obtener constancias relativas a los mismos. La publicidad se da a través de la inscripción en la institución registral, pues la celebración de un contrato no es suficiente para ser oponible a terceros."]
[]
[null,null,null,"Rogación: Se refiere a la petición de parte interesada, mandato judicial o administrativo dirigido al registrador a fin de que proceda a la inscripción de un acto. El registrador no puede registrar de oficio, aunque conozca el acto que vaya a dar origen a un cambio en los asientos de la institución registral. Se requiere que alguien se lo pida; que alguien haga una solicitud. Esta necesidad de instancia es lo que se conoce con el nombre de principio de rogación. La inscripción en la institución registral se realiza a instancia de parte y nunca de oficio. Este principio está estrechamente ligado con el de consentimiento, pues en la mayoría de los casos, la petición de inscripción debe ser hecha por el titular registral."]
[]
[null,null,null,"Socialización: Se refiere al principio que consiste en el aprovechamiento de la información de la institución registral para el desarrollo social y el fortalecimiento institucional de la estructura de gobierno."]
[]
[null,null,null,"Tercero registral: Se refiere al principio conforme al cual, para efectos del registro, se entiende por tercero, a quien sin ser parte en el acto jurídico que originó la inscripción, tiene un derecho sobre el bien inscrito."]
[]
[null,null,null,"Tracto sucesivo: Se refiere al principio también llamado de tracto continuo. Es un principio de sucesión, de ordenación. Es un derivado del principio del consentimiento, por el que el titular de una inscripción queda inmunizado o protegido contra todo cambio no consentido por él.\n \nEs también consecuencia del sistema de folio real que exige un registro concatenado, en el que el transferente de hoy, es el adquirente de ayer; y el titular inscrito es el transferente de mañana; y solo tiene como excepción que la inscripción que vaya a hacerse sea una “inmatriculación” de un bien inmueble que por no estar inscrito antes en la institución registral, no tenga antecedente registral que deba cancelarse. Del principio de tracto, resulta la posibilidad de llevar al registro lo que provenga del titular inscrito, así como la prohibición de registrar lo que no emana de él."]
[]
[null,null,null,"Ubicación geográfica: Se refiere al principio por el cual, se considera a toda información gráfica que está georreferenciada de acuerdo al marco geodésico vigente."]
[]
[null,null,null,"Veracidad: Se refiere al principio que presume que la información gráfica y alfanumérica que expiden los entes generadores de catastro, representan la realidad física del predio."]
[]
[null,"Programa de modernización de los registros públicos de la propiedad y catastros"]
[null,null,"Se refiere al programa que contribuye al ordenamiento y la planeación territorial como articuladores del bienestar de las personas y el uso eficiente del suelo, a través de instituciones registrales y/o catastrales con apego al Modelo Integral del Registro Público de la Propiedad y Modelo Óptimo de Catastro."]
[]
[null,"RAN"]
[null,null,"Se refiere al Registro Agrario Nacional."]
[]
[null,"Rectificación "]
[null,null,"Se refiere a la rectificación de los asientos por causa de error material o de concepto. Solo procederá cuando exista discrepancia entre el título y la inscripción."]
[]
[null,"Registral"]
[null,null,"Se refiere a las funciones propias de la institución registral como ente encargado principalmente de dar publicidad a los actos jurídicos sujetos de registro o inscripción. "]
[]
[null,"Registro Público de la Propiedad o institución registral"]
[null,null,"Se refiere a la institución mediante la cual el Estado proporciona el servicio de dar publicidad, seguridad y certeza a los actos jurídicos que, conforme a la ley precisan de ese requisito para surtir efectos contra terceros, independientemente de que se encuentren a cargo de la autoridad federal, estatal o municipal."]
[]
[null,"Reposición "]
[null,null,"Se refiere a aquella que se realiza sobre los folios y asientos registrales cuando, por su destrucción, mutilación o extravío no sea posible realizar su consulta a fin de establecer el tracto sucesivo correspondiente."]
[]
[null,"Riesgo"]
[null,null,"Se refiere a los daños o perdidas probables sobre un agente afectable, resultado de la interacción entre su vulnerabilidad y la presencia de un agente perturbador."]
[]
[null,"SAT"]
[null,null,"Se refiere al Servicio de Administración Tributaria. "]
[]
[null,"SEDATU"]
[null,null,"Se refiere a la Secretaría de Desarrollo Agrario, Territorial y Urbano."]
[]
[null,"SHF"]
[null,null,"Se refiere a la Sociedad Hipotecaria Federal."]
[]
[null,"SIGER"]
[null,null,"Se refiere a la plataforma nacional desarrollada por la Secretaría de Economía, denominada Sistema Integral de Gestión Registral."]
[]
[null,"Sistema de gestión registral"]
[null,null,"Se refiere al programa informático a través del cual se realiza la captura almacenamiento, custodia, seguridad, consulta, reproducción, verificación, administración y transmisión de la información en la institución registral."]
[]
[null,"Tecnologías de la información"]
[null,null,"Se refiere a las instalaciones, equipos de computación y de comunicaciones, sistemas de aplicación y bases de datos que tienen que ser administrados para proporcionar soporte a los procesos de una organización; satisfaciendo sus requerimientos de información con efectividad, eficiencia, confidencialidad, integridad, disponibilidad, cumplimiento y confiabilidad."]
[]
[null,"Traslativo de dominio"]
[null,null,"Se refiere al efecto de los actos o contratos que tienen como finalidad la transmisión del dominio del bien y la transmisión de la titularidad de los derechos que sobre el mismo se tienen. Para efectos del censo se definirán los actos traslativos de dominio:"]
[]
[null,null,null,"Adjudicación: Se refiere al acto por medio del cual se declara que la propiedad de un bien o conjunto de bienes pasa al patrimonio de una persona."]
[]
[null,null,null,"Aplicación de bienes por disolución de la sociedad conyugal: Se refiere al acto por el cual la sociedad conyugal puede terminar antes de que se disuelva el matrimonio, si así lo convienen los esposos. La sociedad conyugal termina por la disolución del matrimonio, por voluntad de los consortes, por la sentencia que declare la presunción de muerte del cónyuge ausente y en los casos previstos en la ley en la materia. Disuelta la sociedad se procederá a formar inventario, en el cual no se incluirán el lecho, los vestidos ordinarios y los objetos de uso personal de los consortes, que serán de estos o de sus herederos."]
[]
[null,null,null,"Aportación de bienes a una sociedad: Se refiere la transmisión de bienes del dominio de los socios a la sociedad."]
[]
[null,null,null,"Cesión de bien inmueble: Se refiere a la cesión voluntaria que el deudor haga de sus bienes a favor de sus acreedores."]
[]
[null,null,null,"Compraventa: Se refiere al contrato en el que uno de los contratantes se obliga a transferir la propiedad de una cosa o de un derecho, y el otro a su vez se obliga a pagar por ellos un precio cierto y en dinero."]
[]
[null,null,null,"Dación en pago: Se refiere al acto por el cual el acreedor recibe en pago una cosa distinta en lugar de la debida."]
[]
[null,null,null,"Donación: Se refiere al contrato por el que una persona transfiere a otra, gratuitamente, una parte o la totalidad de sus bienes presentes."]
[]
[null,null,null,"Fideicomiso: Se refiere al contrato en virtud del cual, el fideicomitente transmite a una institución fiduciaria la propiedad o la titularidad de uno o más bienes o derechos, según sea el caso, para ser destinados a fines lícitos y determinados, encomendando la realización de dichos fines a la propia institución fiduciaria. "]
[]
[null,null,null,"Permuta: Se refiere al contrato por el cual cada uno de los contratantes se obliga a dar una cosa por otra."]
[]
[null,null,null,"Prescripción positiva: Se refiere al medio para adquirir bienes mediante el transcurso de cierto tiempo y bajo las condiciones establecidas por la ley. La prescripción positiva también llamada prescripción adquisitiva o usucapión, se refiere a la adquisición de bienes en virtud de la posesión.\n\nEl que hubiere poseído bienes inmuebles por el tiempo y con las condiciones exigidas por la ley en la materia, para adquirirlos por prescripción, puede promover juicio contra el que aparezca como propietario de esos bienes en la institución registral, a fin de que se declare que la prescripción se ha consumado y que ha adquirido, por ende, la propiedad."]
[]
[null,null,null,"Título de propiedad: Se refiere a la causa, razón o motivo que da derecho a algo y también al documento en el que consta ese derecho. En sentido jurídico es una relación existente entre una o más personas respecto de un bien, así como el instrumento que prueba esa relación. La Ley Agraria dispone que el RAN emita el título de propiedad respectivo cuando el ejidatario asuma el dominio pleno sobre sus parcelas, documento que será inscrito en el Registro Público de la Propiedad correspondiente. Asimismo, la Ley Agraria establece que cuando la asamblea efectúe la asignación de solares a ejidatarios y avecindados, el acta respectiva se inscribirá en el RAN y los certificados que expida de cada solar constituirán los títulos de propiedad a favor de su titular, documentos que deben ser inscritos en el Registro Público de la Propiedad de la localidad. "]
[]
[null,"UIF"]
[null,null,"Se refiere a la Unidad de Inteligencia Financiera."]
[]
[null,"Validez jurídica "]
[null,null,"Se refiere a una disposición o conjunto de disposiciones que son reconocidas como normas jurídicas por las leyes."]